program: Orca
programVersion: 5.0.3
elementType: C H C H C C C H H C H H C C H H H H H H H
charge: 1
multiplicity: 1
keywords: m062x def2-TZVP EnGrad RIJCOSX verytightscf def2/J soscf
formula: C8H13
InChI: InChI=1/C8H13/c1-2-4-6-8-7-5-3-1/h1-2,7H,3-6,8H2
21 atoms
C  -1.99451 0.517582 0.087598
H  -2.189923 0.763012 1.134798
C  -1.998643 -1.019236 -0.135973
H  -2.683229 -1.590202 0.492009
C  -0.54391 -1.087274 0.283739
C  0.579305 -1.064434 -0.524473
C  1.901018 -0.629277 0.031275
H  2.009346 -0.981426 1.062782
H  2.726904 -1.033987 -0.559314
C  1.934334 0.937602 0.008045
H  2.127688 1.280625 -1.014591
H  2.754668 1.300314 0.632796
C  0.570538 1.471941 0.485262
C  -0.497134 0.711295 -0.255389
H  0.485203 -1.270741 -1.589745
H  -2.147681 -1.286969 -1.185659
H  0.445422 1.379775 1.569502
H  -0.38151 0.801875 -1.338879
H  -2.655984 1.102567 -0.556763
H  0.472509 2.537071 0.233981
H  -0.373995 -1.036985 1.359903
totalener: -312.32073740 hartree
nucrepener: 387.46907403 hartree
electener: -699.78981143 hartree
oneelecener: -1175.50930649 hartree
twoeener: 475.71949506 hartree
kineticenergy: 310.42107014 hartree
xcener: -23.118849440678 hartree
chargesum: 1.0000000
charge: -0.256028 0.200025 -0.272860 0.199849 -0.073575 -0.010047 -0.331159 0.202818 0.203365 -0.302925 0.198976 0.198115 -0.291439 -0.104605 0.221380 0.195225 0.188451 0.219513 0.197012 0.207454 0.210456
charge: -0.187176 0.158516 -0.184901 0.154939 -0.062678 -0.013488 -0.208967 0.162218 0.163574 -0.215472 0.152870 0.156363 -0.229801 -0.020708 0.170654 0.157740 0.156169 0.180649 0.154265 0.174795 0.180440
qa: -0.2560 0.2000 -0.2729 0.1998 -0.0736 -0.0100 -0.3312 0.2028 0.2034 -0.3029 0.1990 0.1981 -0.2914 -0.1046 0.2214 0.1952 0.1885 0.2195 0.1970 0.2075 0.2105
va: 3.7437 0.9577 3.7591 0.9636 3.7064 3.5854 3.7719 0.9448 0.9584 3.7182 0.9484 0.9587 3.7381 3.6050 0.9404 0.9564 0.9538 0.9347 0.9617 0.9513 0.9437
energy: -312.320737398582
dipole: 0.55236 -0.69965 -0.14730 1.83929 -1.91687 -0.07758 0.22554 -0.39637 -0.17083
magnitude: 0.23853 au
magnitude: 0.60630 debye
