program: Orca
programVersion: 5.0.3
elementType: C H C H C C C H H C H H C C H H H H H H H
charge: 1
multiplicity: 1
keywords: DSD-PBEP86/2013 cc-pVTZ EnGrad D3BJ RIJCOSX verytightscf cc-pVTZ/C def2/J soscf
formula: C8H13
InChI: InChI=1/C8H13/c1-2-4-6-8-7-5-3-1/h1-2,7H,3-6,8H2
21 atoms
C  -1.998767 0.525524 0.118465
H  -2.178536 0.72308 1.178676
C  -1.969336 -1.00203 -0.167266
H  -2.677316 -1.597734 0.410584
C  -0.526339 -1.118052 0.277344
C  0.605474 -1.108227 -0.508868
C  1.905639 -0.645901 0.061507
H  2.001664 -0.953406 1.108222
H  2.755885 -1.045709 -0.497441
C  1.905503 0.920209 -0.02838
H  2.04572 1.219935 -1.073456
H  2.749065 1.323242 0.538101
C  0.562716 1.480067 0.486259
C  -0.534508 0.785526 -0.25628
H  0.526942 -1.293588 -1.579635
H  -2.091709 -1.218247 -1.232496
H  0.44942 1.372167 1.570025
H  -0.415347 0.853643 -1.340697
H  -2.701321 1.107428 -0.485736
H  0.5067 2.555129 0.255659
H  -0.374313 -1.068002 1.35661
totalener: -311.17061691 hartree
nucrepener: 386.18376086 hartree
electener: -697.35437777 hartree
oneelecener: -1172.58867100 hartree
twoeener: 475.23429324 hartree
kineticenergy: 309.74937892 hartree
exchangeener: -14.128651317236 hartree
correlationener: -0.948465808234 hartree
xcener: -15.077117125470 hartree
chargesum: 1.0000000
charge: -0.213707 0.166797 -0.235756 0.183468 -0.057334 -0.053812 -0.249469 0.163945 0.182804 -0.247539 0.159787 0.181149 -0.232426 -0.074543 0.224166 0.167087 0.161741 0.198657 0.181934 0.194313 0.198738
charge: 0.100201 -0.000382 0.103858 -0.000984 0.124212 0.172593 0.083697 0.001689 0.006637 0.097625 -0.006342 -0.000196 0.065331 0.216660 0.003285 -0.000461 -0.002061 0.002659 -0.000170 0.020956 0.011194
qa: -0.2137 0.1668 -0.2358 0.1835 -0.0573 -0.0538 -0.2495 0.1639 0.1828 -0.2475 0.1598 0.1811 -0.2324 -0.0745 0.2242 0.1671 0.1617 0.1987 0.1819 0.1943 0.1987
va: 3.8652 0.9864 3.8851 0.9770 3.7961 3.7794 3.9202 0.9840 0.9766 3.8914 0.9816 0.9731 3.8952 3.7461 0.9603 0.9864 0.9846 0.9786 0.9750 0.9683 0.9783
dispcorr: -0.013770690 hartree
energy: -311.859173141458
dipole: 0.55932 -0.70699 -0.14767 1.85148 -1.83251 0.01897 0.19517 -0.35584 -0.16067
magnitude: 0.21905 au
magnitude: 0.55678 debye
