program: Gaussian 09
title: 000050657
version: EM64L-G09RevD.01
frameworkgroup: C1[X(C8H8O3)]
method: RPBEPBE
basis: SDD
operation: Freq
keyword: #p
keyword: freq=noraman
keyword: PBEPBE/SDD
title: #p freq=noraman PBEPBE/SDD
converged: YES YES NO NO
title: Mulliken charges:
elementType: O O O C C C C C C C C H H H H H H H H
charge: -0.238681 -0.428759 -0.248681 -0.546652 0.324343 -0.391065 -0.073918 -0.257216 -0.175304 -0.311295 0.167771 0.243051 0.244051 0.264278 0.275823 0.253332 0.259530 0.260937 0.378456
chargesum: 0.00000
title: Mulliken charges with hydrogens summed into heavy atoms:
elementType: O O O C C C C C C C C
charge: -0.238681 -0.050303 -0.248681 -0.059551 0.324343 -0.126787 0.201905 -0.003884 0.084226 -0.050358 0.167771
polarizability: 1.46303595e+02 -2.08810490e+00 7.90098538e+01 1.03769116e+01 8.69079873e-01 6.11309653e+01
1716.lowfreq: -9.9810 -2.2748 -0.0007 0.0003 0.0005 5.1903 30.0839 35.8079 64.5196
frequency: 29.9206 35.6658 64.5162 147.5919 165.1214 211.5510 254.5523 295.9051 403.5015 482.1890 579.3280 590.5454 600.8344 627.5627 665.1667 718.7581 724.3394 815.5590 841.6862 870.6091 876.5305 884.7253 920.7304 948.8161 999.0077 1011.6022 1040.9061 1045.0948 1101.9739 1128.5146 1145.2869 1192.5687 1219.6318 1242.9756 1277.6705 1307.0680 1346.5854 1367.5824 1447.3104 1490.2631 1588.9539 1641.0864 1666.7366 2969.7334 3020.8304 3114.2756 3156.2284 3218.9457 3233.7350 3268.9840 3523.7588
redmass: 5.1403 4.9303 6.9746 2.9274 5.1844 3.1213 4.4617 4.0229 3.4814 4.1635 1.6696 3.0563 2.8431 3.9395 2.4339 3.3866 1.4510 1.2842 1.9006 6.0229 1.4587 2.9919 2.9027 2.8342 1.4918 1.3365 2.1965 2.4765 2.0939 1.4928 2.2939 1.3991 1.5580 1.4271 1.3880 1.7013 2.0939 2.3526 1.1112 5.0253 6.3752 8.6580 6.3441 1.0590 1.0994 1.0917 1.0925 1.0922 1.0990 1.1083 1.0640
irintensity: 1.2575 0.1880 0.8556 0.6791 1.2287 4.6357 3.5963 4.6859 4.5742 47.3047 68.5204 19.9111 18.2185 7.0838 51.1724 48.6848 69.7411 31.0231 17.9482 2.4159 0.2149 4.1688 14.1867 48.6013 65.7717 26.4558 272.6239 18.9859 55.2550 5.7895 44.4214 0.8160 2.2443 4.1226 30.8827 4.9045 72.4290 4.5653 20.7446 9.4306 7.0461 242.0871 121.8645 14.8314 10.4499 1.8387 5.7300 5.8585 0.0844 0.3780 42.9023
temp: 298.150 k
press: 1.00000 atm
elementType: 8 8 8 6 6 6 6 6 6 6 6 1 1 1 1 1 1 1 1
symmnumber: 1
zpe: 373970.7 jmol-1
zpe.correction: 0.142438 hartree
zpe.thermalcorrener: 0.152775 hartree
zpe.thermalcorrenthalpy: 0.153720 hartree
zpe.thermalcorrgfe: 0.104323 hartree
zpe.sumelectzpe: -534.480603 hartree
zpe.sumelectthermal: -534.470265 hartree
zpe.sumelectthermalent: -534.469321 hartree
zpe.sumelectthermalfe: -534.518717 hartree
dipole: 0.8693 -0.3805 -1.2099
dipole: 1.5376
quadrupole: -55.1332 -62.5565 -68.2910
quadrupole: 3.3901 3.7597 -3.2182
quadrupole: 6.8603 -0.5629 -6.2974 3.3901 3.7597 -3.2182
hfenergy: -534.6230405 hartree
pointgroup: C01 [X(C8H8O3)]
dipole: -0.3506806 0.0090641 0.4928469 debye
dipolederiv: -0.4319868 0.0189237 -0.0224741 0.0013552 -0.6561785 0.0135863 0.0112822 0.0264848 -0.1324364 -1.1232364 -0.0182448 -0.5540372 -0.085624 -0.4121525 -0.1330167 -0.5271677 -0.1023027 -0.6528166 -0.7202871 -0.1251754 0.097501 -0.1808157 -0.4244569 0.2015846 0.1605644 0.177132 -0.9040311 -0.1286042 -0.0835327 0.0289919 -0.1814003 0.0311181 0.028885 -0.1851447 0.0223537 0.1673131 0.3842136 0.0118035 0.0513462 0.0133937 0.3629941 -0.0131956 0.1894077 -0.0390441 -0.0278707 -0.0503257 0.0625311 0.0199522 0.0504078 -0.1684178 0.009353 -0.0024499 0.0175735 -0.1974997 0.6204794 0.1770838 0.0144014 0.3690932 -0.0899019 -0.0280787 0.1972115 -0.0053205 0.083637 -0.02392 -0.0802725 0.0326542 -0.043877 -0.0669299 -0.016358 0.0481957 -0.0188691 -0.2038357 -0.0546347 -0.0303849 0.0191353 -0.0680618 0.3532024 -0.0263105 0.0204443 -0.0275575 -0.1511615 -0.9219725 -0.1582155 0.0466185 -0.2668584 -0.2039071 -0.0557317 -0.0342448 -0.0675013 0.0377991 1.8826993 0.3551975 0.3136548 0.5542275 0.4532875 -0.174095 0.0201734 -0.2205823 1.2214316 0.003485 -0.0497151 -0.0240535 -0.012088 -0.0220201 -0.0614614 0.0700397 -0.0789074 0.0772932 -0.039247 0.0700109 -0.0599778 0.0635884 0.0659125 0.0337096 -0.0230026 0.0904161 -0.0918819 0.0327602 -0.0779549 -0.0163916 -0.1022038 0.0777342 -0.007788 -0.0385654 -0.0047506 0.1865872 0.1056008 -0.0247002 0.0020189 -0.0554902 0.1172615 0.058571 0.0056465 0.0484336 -0.0143366 0.0605963 0.074644 -0.0204607 0.0926485 0.0113285 0.0203273 -0.0232954 0.0197985 0.1963793 0.0065287 -0.0196152 -0.0275019 -0.0324345 0.0837273 0.0006519 -0.0477086 0.0029684 0.2219917 0.0918064 -0.0402867 0.0122184 -0.0448901 0.1431875 0.0648567 0.0282843 0.0645717 -0.0328313 0.3060447 -0.0620968 0.0864037 -0.0709706 0.3442111 0.0845102 0.1303293 0.0951032 0.2162693 unknown
polarizability: 145.6493745|7.2937928|76.7919134|10.6217529|-5.9457938|64.0031266 unknown
InChI: InChI=1S/C8H8O3/c9-8(10)5-1-3-7-4-2-6-11-7/h1-2,4-6,9H,3H2
charge 0 multiplicity 1
19 atoms
O  -2.838228 -0.993278 0.031411
O  4.24808 0.350094 0.894203
O  3.332807 0.648046 -1.226038
C  -0.393873 -1.183821 0.39767
C  -1.602992 -0.317792 0.169687
C  -1.817197 1.048639 0.079801
C  0.866908 -0.553855 -0.14496
C  -3.239276 1.250336 -0.123574
C  -3.824606 -0.002124 -0.144223
C  2.002602 -0.353099 0.578326
C  3.201224 0.252855 -0.041248
H  -0.569256 -2.150118 -0.11928
H  -0.274304 -1.419544 1.473031
H  -1.051389 1.818751 0.150219
H  0.858994 -0.244882 -1.200438
H  -3.753375 2.202554 -0.23811
H  -4.840727 -0.366455 -0.264417
H  2.079668 -0.626308 1.63585
H  5.039141 0.759899 0.450289
