program: Orca
programVersion: 5.0.3
elementType: C H C H C C C H H C H H C C H H H H H H H
charge: 1
multiplicity: 1
keywords: b3lyp def2-TZVP EnGrad D3BJ RIJCOSX verytightscf def2/J soscf
formula: C8H13
InChI: InChI=1/C8H13/c1-2-4-6-8-7-5-3-1/h1-2,7H,3-6,8H2
21 atoms
C  -1.997337 0.757331 0.071798
H  -2.167639 0.84189 1.14797
C  -1.733191 -0.958497 -0.154131
H  -2.618429 -1.316644 0.375989
C  -0.420172 -1.383194 0.395913
C  0.688589 -1.279648 -0.373114
C  2.003315 -0.689343 0.063908
H  2.213385 -0.882647 1.121545
H  2.856885 -1.0320 -0.526581
C  1.791758 0.869113 -0.143279
H  1.83982 1.124452 -1.20731
H  2.596901 1.413803 0.356302
C  0.42177 1.254446 0.479802
C  -0.76655 1.307345 -0.378189
H  0.52484 -1.208354 -1.453094
H  -1.837481 -1.123369 -1.226995
H  0.168956 0.487078 1.224729
H  -0.655465 1.541149 -1.441054
H  -2.879794 0.986557 -0.524294
H  0.442005 2.149562 1.126315
H  -0.340147 -1.49567 1.477219
totalener: -312.20462790 hartree
nucrepener: 379.77163764 hartree
electener: -691.97626553 hartree
oneelecener: -1160.59349099 hartree
twoeener: 468.61722546 hartree
kineticenergy: 310.52940745 hartree
exchangeener: -36.316885606896 hartree
correlationener: -2.303994680304 hartree
xcener: -38.620880287200 hartree
chargesum: 1.0000000
charge: -0.228207 0.186223 -0.209746 0.186005 -0.169553 -0.061328 -0.211382 0.148020 0.156216 -0.257223 0.147784 0.159318 -0.117726 0.078450 0.128673 0.178070 0.134492 0.195581 0.184567 0.208265 0.163501
charge: -0.160862 0.169405 -0.121317 0.164071 -0.186709 -0.106176 -0.214766 0.150596 0.150266 -0.201802 0.144817 0.153817 -0.209478 0.093376 0.152777 0.155312 0.187994 0.169867 0.161185 0.197009 0.150617
qa: -0.2282 0.1862 -0.2097 0.1860 -0.1696 -0.0613 -0.2114 0.1480 0.1562 -0.2572 0.1478 0.1593 -0.1177 0.0785 0.1287 0.1781 0.1345 0.1956 0.1846 0.2083 0.1635
va: 3.8503 0.9601 3.8287 0.9560 3.8046 3.8111 3.8515 0.9690 0.9730 3.8982 0.9671 0.9687 3.7152 3.6071 0.9684 0.9597 1.0127 0.9537 0.9651 0.9470 0.9651
dispcorr: -0.036849167 hartree
energy: -312.241477062411
dipole: 0.13460 -0.97244 -0.83784 1.39094 -0.37955 1.01138 0.42216 -0.51319 -0.09103
magnitude: 1.31650 au
magnitude: 3.34626 debye
