program: Orca
programVersion: 5.0.3
charge: 1
multiplicity: 1
keywords: DLPNO-CCSD(T1) tightPNO Extrapolate(3/4,def2) RIJK def2/JK verytightSCF miniprint nopop
formula: C8H13
InChI: InChI=1/C8H12.H/c1-2-4-6-8-7-5-3-1;/h1-2,7-8H,3-6H2;
21 atoms
C  -1.972039 0.651332 0.127162
H  -2.117572 0.84232 1.195136
C  -1.853488 -0.949375 -0.116715
H  -2.653432 -1.44145 0.439524
C  -0.471324 -1.348786 0.370954
C  0.671511 -1.255694 -0.387046
C  1.972551 -0.653767 0.115754
H  2.121014 -0.85404 1.181539
H  2.844799 -1.012798 -0.433221
C  1.852316 0.951585 -0.113727
H  1.979447 1.17404 -1.177662
H  2.655012 1.436613 0.44452
C  0.472752 1.348564 0.380856
C  -0.671539 1.259938 -0.372949
H  0.551389 -1.263283 -1.473308
H  -1.983433 -1.163732 -1.18211
H  -0.001753 -0.001193 -0.01764
H  -0.555171 1.281676 -1.460103
H  -2.845537 1.017858 -0.415327
H  0.349294 1.322539 1.47147
H  -0.346556 -1.347257 1.455136
e0: -310.241223388 hartree
corrType: DLPNO BASED
e0: -310.254801720 hartree
basis: def2-TZVPP def2-QZVPP
scfener: -310.241223388 -310.254801720
corrmethod: MDCI MDCI
correner: -1.473666930 -1.544054505
corrcbsextra: -1.596193410
energy: -311.852865391619
dipole: -0.00306 0.00543 0.00237 -0.01228 0.00175 -0.01053 0.01732 -0.01421 0.00311
magnitude: 0.01124 au
magnitude: 0.02857 debye
