program: Orca
programVersion: 5.0.3
elementType: C H C H C C C H H C H H C C H H H H H H H
charge: 1
multiplicity: 1
keywords: PBE0 cc-pVTZ EnGrad RIJCOSX verytightscf cc-pVTZ/C def2/J soscf
formula: C8H13
InChI: InChI=1/C8H13/c1-3-7-5-2-6-8(4-1)9-7/h3,6-8H,1-2,4-5H2
21 atoms
C  -1.996904 0.672268 0.102554
H  -2.192785 0.863771 1.161999
C  -1.823505 -0.93062 -0.131868
H  -2.64137 -1.433736 0.386931
C  -0.453201 -1.335178 0.396384
C  0.689262 -1.272095 -0.366646
C  2.000022 -0.670989 0.0916
H  2.200267 -0.872694 1.148349
H  2.850593 -1.011541 -0.501594
C  1.826562 0.929808 -0.130732
H  1.909393 1.15166 -1.199472
H  2.641096 1.434601 0.391806
C  0.452183 1.320755 0.402351
C  -0.694014 1.285379 -0.357433
H  0.540392 -1.240623 -1.449896
H  -1.908449 -1.142648 -1.202382
H  0.003058 -0.000902 0.138685
H  -0.55427 1.283148 -1.442118
H  -2.853316 1.010742 -0.483321
H  0.345533 1.342883 1.489906
H  -0.345389 -1.382335 1.482963
totalener: -312.01666832 hartree
nucrepener: 382.84391369 hartree
electener: -694.86058202 hartree
oneelecener: -1166.17234697 hartree
twoeener: 471.31176496 hartree
kineticenergy: 309.60436901 hartree
exchangeener: -34.146256449476 hartree
correlationener: -1.976781421665 hartree
xcener: -36.123037871142 hartree
chargesum: 1.0000000
charge: -0.194064 0.150334 -0.202518 0.158884 -0.053864 -0.030307 -0.193137 0.149660 0.159770 -0.201787 0.148192 0.158658 -0.054783 -0.030623 0.159136 0.148644 0.082229 0.160217 0.159860 0.162272 0.163227
charge: 0.108094 -0.001923 0.113154 0.002325 0.127592 0.149663 0.108047 -0.002036 0.003178 0.113133 -0.002799 0.002150 0.125673 0.151480 0.004062 -0.002701 -0.014587 0.003251 0.003245 0.004903 0.004095
qa: -0.1941 0.1503 -0.2025 0.1589 -0.0539 -0.0303 -0.1931 0.1497 0.1598 -0.2018 0.1482 0.1587 -0.0548 -0.0306 0.1591 0.1486 0.0822 0.1602 0.1599 0.1623 0.1632
va: 3.8746 0.9902 3.8890 0.9863 3.7900 3.7928 3.8744 0.9905 0.9854 3.8893 0.9912 0.9865 3.7921 3.7920 0.9948 0.9909 1.1458 0.9940 0.9854 0.9954 0.9948
energy: -312.016668321823
dipole: -0.00488 -0.00284 -0.00772 0.00282 -0.00445 -0.00163 -0.07285 0.05628 -0.01657
magnitude: 0.01835 au
magnitude: 0.04664 debye
