program: Gaussian 09
title: 000050719
version: EM64L-G09RevD.01
frameworkgroup: C1[X(C18H30N2O2)]
method: RPBEPBE
basis: SDD
operation: Freq
keyword: #p
keyword: freq=noraman
keyword: PBEPBE/SDD
title: #p freq=noraman PBEPBE/SDD
converged: YES YES NO NO
title: Mulliken charges:
elementType: O O N N C C C C C C C C C C C C C C C C C C H H H H H H H H H H H H H H H H H H H H H H H H H H H H H H
charge: -0.296604 -0.270773 -0.106922 -0.685331 -0.048128 -0.381758 -0.390821 -0.373288 -0.733074 -0.353748 -0.358992 -0.637830 -0.356801 -0.280263 -0.696314 0.187582 0.224646 -0.336035 -0.326526 -0.406402 -0.400730 0.499777 0.196121 0.196523 0.200364 0.205475 0.185983 0.191724 0.188296 0.221082 0.234521 0.202671 0.188307 0.187796 0.219062 0.198496 0.222781 0.190080 0.223757 0.195034 0.195072 0.238208 0.223623 0.209843 0.215246 0.209845 0.265432 0.263789 0.220532 0.218452 0.309785 0.310431
chargesum: 0.00000
title: Mulliken charges with hydrogens summed into heavy atoms:
elementType: O O N N C C C C C C C C C C C C C C C C C C
charge: -0.296604 -0.270773 -0.106922 -0.065114 0.147993 0.015129 0.000637 0.006732 -0.074800 0.022355 0.058566 -0.001210 0.033305 0.181568 -0.061379 0.187582 0.224646 -0.070603 -0.062737 -0.185870 -0.182278 0.499777
polarizability: 3.04557366e+02 -2.77475828e+01 2.38529348e+02 5.84958666e-01 1.01863627e-01 1.47578511e+02
1716.lowfreq: -12.1113 -0.0008 -0.0007 0.0013 2.2206 5.0704 10.1983 19.4809 26.7183
frequency: 5.8902 19.0666 26.4718 32.1331 47.3453 48.9894 61.4369 72.5621 80.1770 88.5687 96.0164 114.1363 133.0864 142.2249 149.1248 168.5673 184.6328 197.6799 217.5666 223.6658 227.9750 256.0118 291.9160 297.9318 323.6876 350.0812 357.9686 373.2393 399.3996 407.0394 408.8934 412.6333 416.5978 465.0903 477.2655 508.9018 518.5209 563.8253 608.8554 634.0482 677.5152 722.4798 735.5446 751.0334 755.2443 780.4820 786.0784 799.3228 825.5125 828.5705 844.0890 859.0914 874.8832 892.0520 919.9128 950.7467 973.2294 974.1275 985.4275 998.2526 1004.6381 1017.6261 1018.2633 1028.5826 1053.3965 1057.0302 1061.2526 1074.2131 1079.3124 1088.2995 1103.8434 1115.1225 1129.4012 1131.0827 1141.4228 1169.5860 1181.1511 1192.2381 1210.8611 1228.3526 1244.0074 1247.7711 1253.4468 1276.7299 1282.2546 1283.0870 1292.4419 1295.4110 1308.9193 1320.0643 1322.6768 1324.2450 1326.7822 1346.7331 1350.5513 1366.0402 1379.3755 1386.9928 1388.7494 1391.8213 1437.2753 1447.5639 1454.3442 1461.2721 1462.2730 1465.5230 1466.4812 1472.6944 1474.4135 1476.3052 1478.6968 1481.8901 1486.0192 1486.9390 1488.5943 1517.3977 1570.4415 1611.3248 1632.0635 1646.1885 2862.9558 2902.2657 2949.3308 2950.7628 2953.8479 2959.9267 2965.6943 2967.6648 2971.4373 2981.6114 2985.3340 2996.0182 3007.5128 3015.5039 3019.2315 3024.9140 3039.7774 3054.5184 3067.9438 3070.2573 3072.4815 3074.6717 3089.2429 3092.3004 3122.9200 3125.7441 3158.8541 3172.7917 3561.4228 3701.3371
redmass: 4.4704 4.9823 2.6438 2.8127 3.0309 2.4249 3.3883 3.5719 3.4413 1.8980 4.8154 2.0272 2.9442 2.1975 4.2732 3.3102 2.0426 1.5452 1.4908 1.7659 1.1176 4.2017 4.5217 3.3343 3.0118 2.9577 4.3846 2.9809 3.1993 1.1632 2.7391 1.3269 1.9545 2.8509 3.7509 2.8452 3.2071 3.5532 6.0987 6.9149 4.0011 1.0650 1.1249 3.9207 4.3987 1.4227 1.2784 2.3353 1.2657 5.3673 1.8372 1.7552 1.5699 1.8695 7.8739 1.2474 2.0243 1.3979 1.3492 3.2367 2.7246 1.4028 1.3400 3.3534 1.6346 3.8676 2.4095 2.1053 2.2280 3.0587 2.1171 1.4138 2.8348 1.2192 1.9111 1.5784 1.1453 1.6690 1.7768 1.3661 1.5476 1.4651 2.5564 1.2472 1.2029 1.0883 1.1091 1.3070 1.3224 1.5176 1.3735 1.3901 2.5268 1.4932 1.6495 1.2999 1.4509 1.2610 1.2161 4.8595 1.1531 4.1790 1.0751 1.0720 1.0708 1.0748 1.0549 1.0672 1.0691 1.0433 1.0621 1.0806 1.0676 1.0545 1.0877 3.1968 7.3074 10.2476 3.1841 1.4476 1.0566 1.0703 1.0588 1.0595 1.0596 1.0633 1.0766 1.0621 1.0364 1.0379 1.0949 1.0977 1.1024 1.0620 1.0675 1.1040 1.1042 1.0900 1.1006 1.0993 1.0988 1.0995 1.1070 1.0999 1.0894 1.0893 1.0952 1.0947 1.0450 1.1040
irintensity: 0.2043 1.6601 0.1687 0.0910 0.7659 0.2091 0.6369 0.6937 1.4513 0.0329 1.1899 0.0248 0.1828 0.0603 0.1261 1.2150 0.3141 0.0342 0.8520 0.8376 0.0099 5.4611 8.1935 6.7977 3.6890 5.7602 10.1243 0.0970 9.5989 186.1942 2.9621 114.9413 13.7956 3.3199 8.4531 3.1206 1.2605 19.1737 8.7637 2.0526 26.7067 12.0626 0.1561 10.4500 12.9678 6.1067 3.7358 4.9796 0.7816 2.2982 72.4382 2.2096 0.9292 4.6578 33.7422 2.1459 13.3356 0.9691 0.2049 39.5646 19.8199 7.2919 12.5679 9.8273 8.0487 456.6766 11.9173 13.1340 0.5518 26.6683 26.7846 5.2878 5.2494 12.9878 23.5249 26.6705 186.6084 5.1447 11.6208 27.0302 5.0257 13.1024 363.0385 1.3174 4.0743 0.4140 0.3076 13.6863 2.5528 4.6483 1.8389 11.1861 119.3772 2.6028 0.6382 4.3766 18.3632 29.3367 8.9543 12.0757 10.4563 6.4598 2.5488 0.1895 0.0597 0.4053 8.1221 5.7667 2.4077 12.1604 14.6054 2.7537 11.3840 6.7959 26.6823 70.6164 29.3864 340.4038 96.4854 328.6214 107.6064 61.3915 0.4546 1.6373 0.8625 26.6466 8.6590 167.3539 39.6629 18.2367 2.2047 4.6023 4.8227 7.8947 61.9755 1.2645 141.4290 10.6498 93.4398 53.3416 16.6053 85.1472 42.4707 32.2303 15.8154 23.1654 9.7684 3.8701 109.4580 22.8323
temp: 298.150 k
press: 1.00000 atm
elementType: 8 8 7 7 6 6 6 6 6 6 6 6 6 6 6 6 6 6 6 6 6 6 1 1 1 1 1 1 1 1 1 1 1 1 1 1 1 1 1 1 1 1 1 1 1 1 1 1 1 1 1 1
symmnumber: 1
zpe: 1182823.0 jmol-1
zpe.correction: 0.450514 hartree
zpe.thermalcorrener: 0.476395 hartree
zpe.thermalcorrenthalpy: 0.477339 hartree
zpe.thermalcorrgfe: 0.389749 hartree
zpe.sumelectzpe: -962.136118 hartree
zpe.sumelectthermal: -962.110237 hartree
zpe.sumelectthermalent: -962.109293 hartree
zpe.sumelectthermalfe: -962.196883 hartree
dipole: -0.6534 4.7294 -0.4528
dipole: 4.7958
quadrupole: -99.6418 -128.7164 -138.3007
quadrupole: -31.9361 -0.9004 2.4293
quadrupole: 22.5778 -6.4968 -16.0810 -31.9361 -0.9004 2.4293
hfenergy: -962.5866318 hartree
pointgroup: C01 [X(C18H30N2O2)]
dipole: 0.307664 1.8595411 0.0865436 debye
polarizability: 305.9547067|25.8924442|236.8833807|-2.4834226|-4.656414|147.827138 unknown
InChI: InChI=1S/C18H30N2O2/c1-4-5-6-7-8-15(2)20(3)13-14-22-18(21)16-9-11-17(19)12-10-16/h9-12,15H,4-8,13-14,19H2,1-3H3
charge 0 multiplicity 1
52 atoms
O  1.974013 -0.77408 0.011112
O  3.579875 -2.467073 0.039637
N  -1.520034 -2.067361 0.365147
N  7.221856 2.922658 -0.262878
C  -2.801422 -1.726474 -0.327418
C  -3.442726 -0.386477 0.1522
C  -4.899126 -0.172924 -0.321242
C  -5.551493 1.089492 0.288123
C  -2.622659 -1.777069 -1.860807
C  -7.004232 1.319485 -0.186197
C  -0.417365 -1.089826 0.221667
C  -1.693883 -2.542955 1.751046
C  -7.655162 2.580236 0.427587
C  0.921493 -1.8252 0.068364
C  -9.105814 2.804193 -0.051411
C  3.300448 -1.239293 -0.002556
C  4.282521 -0.134766 -0.069759
C  5.666697 -0.458901 -0.09303
C  3.900609 1.233994 -0.112133
C  6.642386 0.545226 -0.15658
C  4.868636 2.247589 -0.175557
C  6.259118 1.920886 -0.199213
H  -3.502095 -2.543681 -0.05301
H  -2.818656 0.464525 -0.1917
H  -3.427967 -0.362407 1.261926
H  -4.932361 -0.096245 -1.426642
H  -5.507015 -1.062734 -0.050751
H  -4.937838 1.978691 0.031818
H  -5.53515 1.010818 1.395559
H  -3.599443 -1.714539 -2.372336
H  -2.136701 -2.725024 -2.149392
H  -2.000804 -0.940801 -2.232354
H  -7.021223 1.40235 -1.293334
H  -7.619057 0.430348 0.06751
H  -0.581013 -0.473493 -0.678868
H  -0.35039 -0.388803 1.086925
H  -0.744631 -2.962123 2.13015
H  -2.018398 -1.748755 2.469427
H  -2.446075 -3.351977 1.773466
H  -7.039133 3.467346 0.174201
H  -7.637955 2.496512 1.533596
H  0.94612 -2.420583 -0.860875
H  1.134929 -2.500841 0.915741
H  -9.146165 2.923308 -1.150776
H  -9.548914 3.709674 0.402776
H  -9.74791 1.943354 0.215161
H  5.952458 -1.51574 -0.060196
H  2.836861 1.487733 -0.09461
H  7.706044 0.278275 -0.174254
H  4.560027 3.299724 -0.207694
H  6.954714 3.90242 -0.294149
H  8.211704 2.694012 -0.280219
