program: Orca
programVersion: 5.0.3
elementType: C H C H C C C H H C H H C C H H H H H H H
charge: 1
multiplicity: 1
keywords: DSD-PBEP86/2013 cc-pVTZ EnGrad D3BJ RIJCOSX verytightscf cc-pVTZ/C def2/J soscf
formula: C8H13
InChI: InChI=1/C8H13/c1-3-7-5-2-6-8(4-1)9-7/h3,6-8H,1-2,4-5H2
21 atoms
C  -2.00137 0.678914 0.097663
H  -2.205087 0.869693 1.155688
C  -1.814405 -0.925746 -0.134071
H  -2.636601 -1.42892 0.377731
C  -0.44781 -1.334518 0.401867
C  0.693397 -1.274511 -0.363935
C  2.005003 -0.67604 0.087181
H  2.21253 -0.877538 1.142527
H  2.852788 -1.012079 -0.512527
C  1.819861 0.923602 -0.133618
H  1.895101 1.145136 -1.203005
H  2.636159 1.432341 0.382283
C  0.446194 1.314865 0.406477
C  -0.700249 1.292073 -0.356066
H  0.537235 -1.225912 -1.445689
H  -1.89205 -1.137159 -1.205219
H  0.004467 0.003055 0.193935
H  -0.555379 1.280034 -1.440151
H  -2.855995 1.009151 -0.495378
H  0.343455 1.362371 1.493661
H  -0.344434 -1.408721 1.48727
totalener: -311.09145863 hartree
nucrepener: 382.79968132 hartree
electener: -693.89113995 hartree
oneelecener: -1165.49570228 hartree
twoeener: 471.60456232 hartree
kineticenergy: 309.66644120 hartree
exchangeener: -14.114919815484 hartree
correlationener: -0.949190345044 hartree
xcener: -15.064110160527 hartree
chargesum: 1.0000000
charge: -0.251335 0.173395 -0.264218 0.186243 -0.070547 -0.046175 -0.250489 0.172350 0.186129 -0.262795 0.169571 0.186018 -0.071825 -0.045763 0.182159 0.170137 0.080659 0.184659 0.186343 0.192168 0.193315
charge: 0.107552 -0.003064 0.113825 0.001029 0.125526 0.153822 0.106929 -0.003203 0.002216 0.113914 -0.004423 0.000828 0.124772 0.158398 0.003051 -0.004369 -0.010931 0.002626 0.002347 0.005446 0.003709
qa: -0.2513 0.1734 -0.2642 0.1862 -0.0705 -0.0462 -0.2505 0.1723 0.1861 -0.2628 0.1696 0.1860 -0.0718 -0.0458 0.1822 0.1701 0.0807 0.1847 0.1863 0.1922 0.1933
va: 3.8908 0.9810 3.9131 0.9740 3.7919 3.8047 3.8904 0.9816 0.9733 3.9128 0.9826 0.9743 3.7943 3.8018 0.9830 0.9821 1.1437 0.9815 0.9734 0.9815 0.9806
dispcorr: -0.014309625 hartree
energy: -311.791597645179
dipole: -0.00728 -0.00624 -0.01352 0.01128 -0.00137 0.00991 -0.06424 0.05073 -0.01351
magnitude: 0.02153 au
magnitude: 0.05472 debye
