program: Orca
programVersion: 5.0.3
elementType: C H C H C C C H H C H H C C H H H H H H H
charge: 1
multiplicity: 1
keywords: PBE0 cc-pVTZ EnGrad RIJCOSX verytightscf cc-pVTZ/C def2/J soscf
formula: C8H13
InChI: InChI=1/C8H12.H/c1-2-4-6-8-7-5-3-1;/h1-2,7-8H,3-6H2;
21 atoms
C  -1.972039 0.651332 0.127162
H  -2.117572 0.84232 1.195136
C  -1.853488 -0.949375 -0.116715
H  -2.653432 -1.44145 0.439524
C  -0.471324 -1.348786 0.370954
C  0.671511 -1.255694 -0.387046
C  1.972551 -0.653767 0.115754
H  2.121014 -0.85404 1.181539
H  2.844799 -1.012798 -0.433221
C  1.852316 0.951585 -0.113727
H  1.979447 1.17404 -1.177662
H  2.655012 1.436613 0.44452
C  0.472752 1.348564 0.380856
C  -0.671539 1.259938 -0.372949
H  0.551389 -1.263283 -1.473308
H  -1.983433 -1.163732 -1.18211
H  -0.001753 -0.001193 -0.01764
H  -0.555171 1.281676 -1.460103
H  -2.845537 1.017858 -0.415327
H  0.349294 1.322539 1.47147
H  -0.346556 -1.347257 1.455136
totalener: -312.01754221 hartree
nucrepener: 382.95291103 hartree
electener: -694.97045323 hartree
oneelecener: -1166.37488721 hartree
twoeener: 471.40443398 hartree
kineticenergy: 309.60573254 hartree
exchangeener: -34.146691444239 hartree
correlationener: -1.977110234208 hartree
xcener: -36.123801678447 hartree
chargesum: 1.0000000
charge: -0.198064 0.148957 -0.196658 0.159551 -0.042322 -0.043190 -0.198580 0.149135 0.159387 -0.197298 0.149250 0.159751 -0.039642 -0.044124 0.161261 0.149246 0.083717 0.160593 0.159079 0.158434 0.161517
charge: 0.110362 -0.002237 0.110176 0.003021 0.140845 0.137966 0.111028 -0.002302 0.002735 0.110025 -0.002402 0.002873 0.137685 0.136033 0.003961 -0.002186 -0.013395 0.003961 0.002820 0.006083 0.002949
qa: -0.1981 0.1490 -0.1967 0.1596 -0.0423 -0.0432 -0.1986 0.1491 0.1594 -0.1973 0.1493 0.1598 -0.0396 -0.0441 0.1613 0.1492 0.0837 0.1606 0.1591 0.1584 0.1615
va: 3.8826 0.9907 3.8797 0.9858 3.7935 3.7930 3.8827 0.9907 0.9861 3.8801 0.9909 0.9858 3.7938 3.7943 0.9950 0.9908 1.1497 0.9951 0.9861 0.9954 0.9949
energy: -312.017542205257
dipole: -0.00306 0.00492 0.00187 -0.01228 0.00384 -0.00844 0.01732 -0.01638 0.00094
magnitude: 0.00870 au
magnitude: 0.02211 debye
