program: Orca
programVersion: 5.0.3
elementType: C H C H C C C H H C H H C C H H H H H H H
charge: 1
multiplicity: 1
keywords: PBE0 cc-pVTZ EnGrad RIJCOSX verytightscf cc-pVTZ/C def2/J soscf
formula: C8H13
InChI: InChI=1/C8H12.H/c1-2-4-6-8-7-5-3-1;/h1-2,7-8H,3-6H2;
21 atoms
C  -1.985418 0.660494 0.113949
H  -2.159244 0.852025 1.177384
C  -1.8397 -0.941439 -0.125734
H  -2.64914 -1.439582 0.410891
C  -0.46316 -1.340434 0.383749
C  0.679887 -1.265444 -0.375672
C  1.986718 -0.66094 0.102236
H  2.164582 -0.862094 1.163233
H  2.846838 -1.011246 -0.471228
C  1.840468 0.94194 -0.123453
H  1.943036 1.164995 -1.190161
H  2.649778 1.437408 0.41587
C  0.463663 1.333374 0.392653
C  -0.682346 1.27189 -0.363834
H  0.546214 -1.261884 -1.460949
H  -1.945092 -1.154707 -1.194156
H  0.001024 0.001092 0.050391
H  -0.553791 1.283938 -1.449608
H  -2.848697 1.01377 -0.45288
H  0.349386 1.325915 1.479889
H  -0.34659 -1.349007 1.470502
totalener: -312.01739469 hartree
nucrepener: 382.90014986 hartree
electener: -694.91754455 hartree
oneelecener: -1166.27252607 hartree
twoeener: 471.35498152 hartree
kineticenergy: 309.60544387 hartree
exchangeener: -34.146694828575 hartree
correlationener: -1.977012617728 hartree
xcener: -36.123707446303 hartree
chargesum: 1.0000000
charge: -0.196591 0.149938 -0.199425 0.159332 -0.047330 -0.037805 -0.196288 0.149733 0.159363 -0.199126 0.148676 0.159277 -0.047029 -0.037353 0.159877 0.148847 0.083252 0.160330 0.159445 0.161248 0.161628
charge: 0.109536 -0.002121 0.111522 0.002629 0.133741 0.142794 0.109500 -0.002187 0.002953 0.111616 -0.002477 0.002582 0.133536 0.144010 0.003787 -0.002444 -0.013904 0.003695 0.003022 0.004383 0.003827
qa: -0.1966 0.1499 -0.1994 0.1593 -0.0473 -0.0378 -0.1963 0.1497 0.1594 -0.1991 0.1487 0.1593 -0.0470 -0.0374 0.1599 0.1488 0.0833 0.1603 0.1594 0.1612 0.1616
va: 3.8789 0.9903 3.8838 0.9860 3.7933 3.7937 3.8790 0.9904 0.9859 3.8837 0.9911 0.9861 3.7935 3.7929 0.9950 0.9910 1.1493 0.9947 0.9859 0.9954 0.9951
energy: -312.017394691651
dipole: -0.00155 -0.00158 -0.00313 0.00126 0.00171 0.00298 -0.04718 0.03818 -0.00900
magnitude: 0.00998 au
magnitude: 0.02537 debye
