program: Orca
programVersion: 5.0.3
elementType: C H C H C C C H H C H H C C H H H H H H H
charge: 1
multiplicity: 1
keywords: PBE0 cc-pVTZ EnGrad RIJCOSX verytightscf cc-pVTZ/C def2/J soscf
formula: C8H13
InChI: InChI=1/C8H13/c1-2-4-6-8-7-5-3-1/h1-2,7H,3-6,8H2
21 atoms
C  -1.992965 0.517875 0.075766
H  -2.193824 0.779757 1.117906
C  -1.999809 -1.021937 -0.124688
H  -2.681499 -1.581882 0.516136
C  -0.543508 -1.086389 0.288776
C  0.573752 -1.059823 -0.527722
C  1.900858 -0.628323 0.020647
H  2.018429 -0.994657 1.046199
H  2.721031 -1.02656 -0.582071
C  1.936222 0.938664 0.018222
H  2.139529 1.294391 -0.998033
H  2.751163 1.292336 0.655027
C  0.569028 1.469915 0.48905
C  -0.49278 0.708694 -0.260575
H  0.472741 -1.27139 -1.591234
H  -2.155072 -1.306424 -1.168985
H  0.436809 1.3737 1.572122
H  -0.370839 0.80241 -1.343087
H  -2.650465 1.093627 -0.580758
H  0.470831 2.535762 0.241206
H  -0.367026 -1.031806 1.363633
totalener: -312.08714893 hartree
nucrepener: 387.51972149 hartree
electener: -699.60687042 hartree
oneelecener: -1175.80189018 hartree
twoeener: 476.19501976 hartree
kineticenergy: 309.66913205 hartree
exchangeener: -34.181282195637 hartree
correlationener: -1.978812162334 hartree
xcener: -36.160094357972 hartree
chargesum: 1.0000000
charge: -0.153732 0.145371 -0.176062 0.157241 -0.018633 -0.024412 -0.187857 0.142637 0.155418 -0.198030 0.141432 0.151372 -0.171400 -0.088881 0.192437 0.143409 0.135659 0.164268 0.154060 0.162178 0.173525
charge: 0.109646 0.000784 0.109324 -0.000375 0.122625 0.177517 0.086590 0.003827 0.007235 0.096680 -0.005147 0.000574 0.066919 0.182669 0.005799 0.000209 -0.002690 0.006159 -0.001674 0.016871 0.016459
qa: -0.1537 0.1454 -0.1761 0.1572 -0.0186 -0.0244 -0.1879 0.1426 0.1554 -0.1980 0.1414 0.1514 -0.1714 -0.0889 0.1924 0.1434 0.1357 0.1643 0.1541 0.1622 0.1735
va: 3.8564 0.9950 3.8763 0.9878 3.7797 3.7643 3.9034 0.9914 0.9881 3.8808 0.9888 0.9862 3.8695 3.7780 0.9773 0.9955 0.9940 0.9969 0.9861 0.9810 0.9928
energy: -312.087148928736
dipole: 0.55460 -0.69703 -0.14244 1.83397 -1.92152 -0.08755 0.23233 -0.39764 -0.16531
magnitude: 0.23512 au
magnitude: 0.59763 debye
