program: Orca
programVersion: 5.0.3
elementType: C H C H C C C H H C H H C C H H H H H H H
charge: 1
multiplicity: 1
keywords: PBE0 cc-pVTZ EnGrad RIJCOSX verytightscf cc-pVTZ/C def2/J soscf
formula: C8H13
InChI: InChI=1/C8H13/c1-3-7-5-2-6-8(4-1)9-7/h3,6-8H,1-2,4-5H2
21 atoms
C  -2.004489 0.685971 0.093471
H  -2.213194 0.874599 1.150843
C  -1.804866 -0.922285 -0.135969
H  -2.631775 -1.422092 0.371575
C  -0.442721 -1.335355 0.406378
C  0.696532 -1.276785 -0.362389
C  2.00832 -0.680227 0.083333
H  2.220132 -0.880783 1.138033
H  2.854969 -1.012905 -0.51988
C  1.814257 0.917874 -0.136052
H  1.883617 1.139986 -1.205749
H  2.631446 1.430173 0.374879
C  0.440591 1.30871 0.41045
C  -0.706802 1.298786 -0.355983
H  0.53433 -1.213088 -1.442606
H  -1.87862 -1.133335 -1.207359
H  0.007073 0.015278 0.257548
H  -0.557545 1.276627 -1.439455
H  -2.858761 1.007545 -0.504643
H  0.342315 1.391779 1.496137
H  -0.344094 -1.437834 1.489718
totalener: -312.01516534 hartree
nucrepener: 382.71511924 hartree
electener: -694.73028457 hartree
oneelecener: -1165.94738681 hartree
twoeener: 471.21710223 hartree
kineticenergy: 309.60095293 hartree
exchangeener: -34.144874731733 hartree
correlationener: -1.976180517198 hartree
xcener: -36.121055248931 hartree
chargesum: 1.0000000
charge: -0.190966 0.150713 -0.207445 0.158611 -0.062287 -0.027271 -0.188973 0.148531 0.159738 -0.204479 0.147794 0.158028 -0.063282 -0.020138 0.158517 0.149067 0.081467 0.161757 0.160870 0.164700 0.165046
charge: 0.107278 -0.001479 0.115015 0.002115 0.115317 0.153533 0.104967 -0.001812 0.003066 0.115020 -0.003264 0.001758 0.118657 0.165032 0.003031 -0.003219 -0.013060 0.003778 0.003486 0.007411 0.003368
qa: -0.1910 0.1507 -0.2074 0.1586 -0.0623 -0.0273 -0.1890 0.1485 0.1597 -0.2045 0.1478 0.1580 -0.0633 -0.0201 0.1585 0.1491 0.0815 0.1618 0.1609 0.1647 0.1650
va: 3.8685 0.9902 3.8970 0.9864 3.7859 3.7939 3.8694 0.9911 0.9849 3.8964 0.9914 0.9870 3.7878 3.7850 0.9941 0.9907 1.1374 0.9925 0.9849 0.9952 0.9942
energy: -312.015165338657
dipole: -0.00945 -0.02180 -0.03124 0.03412 0.00879 0.04292 -0.03816 0.01699 -0.02117
magnitude: 0.05715 au
magnitude: 0.14527 debye
