program: Orca
programVersion: 5.0.3
elementType: C H C H C C C H H C H H C C H H H H H H H
charge: 1
multiplicity: 1
keywords: DSD-PBEP86/2013 cc-pVTZ EnGrad RIJCOSX verytightscf cc-pVTZ/C def2/J soscf
formula: C8H13
InChI: InChI=1/C8H13/c1-2-4-6-8-7-5-3-1/h1-2,7H,3-6,8H2
21 atoms
C  -1.997221 0.750735 0.07388
H  -2.176786 0.85159 1.147399
C  -1.73861 -0.950068 -0.150819
H  -2.618385 -1.323541 0.378017
C  -0.423366 -1.377559 0.39915
C  0.691209 -1.28216 -0.369941
C  2.004883 -0.688166 0.065271
H  2.216279 -0.87936 1.123094
H  2.857713 -1.029508 -0.526664
C  1.794455 0.878547 -0.144693
H  1.847672 1.128207 -1.209686
H  2.60203 1.418653 0.35548
C  0.422132 1.25372 0.468374
C  -0.762817 1.312746 -0.379276
H  0.527478 -1.212253 -1.44992
H  -1.840625 -1.122347 -1.222982
H  0.146112 0.397661 1.122506
H  -0.646639 1.486378 -1.452745
H  -2.876546 0.984405 -0.525747
H  0.418919 2.043087 1.239657
H  -0.34357 -1.504445 1.479554
totalener: -311.11235358 hartree
nucrepener: 380.08559095 hartree
electener: -691.19794453 hartree
oneelecener: -1160.51173072 hartree
twoeener: 469.31378620 hartree
kineticenergy: 309.70397930 hartree
exchangeener: -12.749701302880 hartree
correlationener: -0.943958774037 hartree
xcener: -13.693660076917 hartree
chargesum: 1.0000000
charge: -0.261647 0.197906 -0.252814 0.201719 -0.149966 -0.121583 -0.241254 0.158982 0.177228 -0.266149 0.163687 0.181506 -0.245229 0.100119 0.168261 0.191149 0.150727 0.224986 0.204577 0.229441 0.188352
charge: 0.127843 0.012547 0.162856 0.009449 0.020198 0.078912 0.078797 -0.004803 -0.003505 0.105900 -0.012278 -0.001454 0.076613 0.306489 -0.016319 -0.000580 0.014147 0.015767 0.008118 0.039165 -0.017862
qa: -0.2616 0.1979 -0.2528 0.2017 -0.1500 -0.1216 -0.2413 0.1590 0.1772 -0.2661 0.1637 0.1815 -0.2452 0.1001 0.1683 0.1911 0.1507 0.2250 0.2046 0.2294 0.1884
va: 3.8896 0.9717 3.9221 0.9650 3.8287 3.8426 3.9083 0.9860 0.9754 3.8969 0.9834 0.9753 3.8694 3.5748 0.9817 0.9722 1.0222 0.9615 0.9698 0.9615 0.9815
energy: -311.818513488448
dipole: 0.10635 -0.96212 -0.85577 1.15963 -0.17241 0.98721 0.42914 -0.51096 -0.08182
magnitude: 1.30905 au
magnitude: 3.32735 debye
