program: Orca
programVersion: 5.0.3
elementType: C H C H C C C H H C H H C C H H H H H H H
charge: 1
multiplicity: 1
keywords: b3lyp cc-pVTZ EnGrad D3BJ RIJCOSX verytightscf cc-pVTZ/C def2/J soscf
formula: C8H13
InChI: InChI=1/C8H13/c1-2-4-6-8-7-5-3-1/h1-2,7H,3-6,8H2
21 atoms
C  -2.002015 0.692051 0.073305
H  -2.176903 0.793325 1.148904
C  -1.755995 -0.964729 -0.171828
H  -2.629129 -1.390634 0.33021
C  -0.411312 -1.36731 0.377345
C  0.672143 -1.266096 -0.403939
C  1.981604 -0.707653 0.066896
H  2.175511 -0.932536 1.120903
H  2.844183 -1.037702 -0.520524
C  1.798047 0.83129 -0.122311
H  1.831856 1.092824 -1.185838
H  2.608153 1.376612 0.369344
C  0.440263 1.343423 0.49977
C  -0.749992 1.265796 -0.337563
H  0.515336 -1.195346 -1.484677
H  -1.833972 -1.141077 -1.247068
H  0.262431 0.917369 1.489202
H  -0.653406 1.624412 -1.36718
H  -2.865553 0.990806 -0.523064
H  0.567164 2.441941 0.631413
H  -0.315799 -1.439437 1.460443
totalener: -312.21693802 hartree
nucrepener: 379.13942952 hartree
electener: -691.35636754 hartree
oneelecener: -1159.33969046 hartree
twoeener: 467.98332293 hartree
kineticenergy: 309.97404708 hartree
exchangeener: -36.297026074043 hartree
correlationener: -2.303215374912 hartree
xcener: -38.600241448954 hartree
chargesum: 1.0000000
charge: -0.186722 0.165391 -0.181767 0.164164 -0.131337 -0.108917 -0.168685 0.129481 0.146728 -0.193261 0.131168 0.151360 -0.167164 0.105204 0.134501 0.154855 0.140848 0.209369 0.170243 0.184470 0.150070
charge: 0.125072 0.012926 0.149069 0.001808 0.037948 0.050953 0.074583 -0.004410 -0.000179 0.115444 -0.010648 -0.001697 0.087803 0.327461 -0.019972 -0.002983 0.005072 0.020042 0.006328 0.050038 -0.024661
qa: -0.1867 0.1654 -0.1818 0.1642 -0.1313 -0.1089 -0.1687 0.1295 0.1467 -0.1933 0.1312 0.1514 -0.1672 0.1052 0.1345 0.1549 0.1408 0.2094 0.1702 0.1845 0.1501
va: 3.8186 0.9835 3.8519 0.9763 3.7843 3.8082 3.8561 0.9932 0.9837 3.8360 0.9896 0.9800 3.8583 3.5073 0.9937 0.9844 0.9993 0.9669 0.9828 0.9740 0.9942
dispcorr: -0.036487144 hartree
energy: -312.253425159653
dipole: 0.30891 -1.04187 -0.73296 1.96659 -0.65605 1.31054 0.20792 -0.33780 -0.12988
magnitude: 1.50719 au
magnitude: 3.83097 debye
