program: Orca
programVersion: 5.0.3
elementType: C H C H C C C H H C H H C C H H H H H H H
charge: 1
multiplicity: 1
keywords: b3lyp def2-TZVP EnGrad D3BJ RIJCOSX verytightscf def2/J soscf
formula: C8H13
InChI: InChI=1/C8H13/c1-2-4-6-8-7-5-3-1/h1-2,7H,3-6,8H2
21 atoms
C  -1.991967 0.550086 0.112397
H  -2.167536 0.735738 1.176215
C  -1.897903 -0.980129 -0.174738
H  -2.668406 -1.54961 0.350248
C  -0.482538 -1.226605 0.311295
C  0.627026 -1.181937 -0.478726
C  1.918112 -0.673645 0.071317
H  2.044392 -0.949123 1.123718
H  2.784802 -1.039822 -0.487308
C  1.857306 0.884368 -0.065524
H  1.935311 1.157744 -1.12464
H  2.708227 1.343625 0.445285
C  0.529631 1.470319 0.505938
C  -0.608442 0.992196 -0.29605
H  0.53277 -1.307462 -1.557466
H  -1.983427 -1.177711 -1.247957
H  0.39817 1.268407 1.573006
H  -0.475769 1.105616 -1.37572
H  -2.769664 1.049504 -0.476745
H  0.589458 2.56739 0.379143
H  -0.341566 -1.196967 1.393395
totalener: -312.24364773 hartree
nucrepener: 382.67127351 hartree
electener: -694.91492123 hartree
oneelecener: -1166.33855089 hartree
twoeener: 471.42362965 hartree
kineticenergy: 310.53377368 hartree
exchangeener: -36.331153603861 hartree
correlationener: -2.306001269698 hartree
xcener: -38.637154873559 hartree
chargesum: 1.0000000
charge: -0.186777 0.155852 -0.190827 0.165662 -0.073898 -0.073929 -0.209058 0.148921 0.161833 -0.218032 0.144474 0.163111 -0.149395 -0.001671 0.171961 0.150693 0.146672 0.185194 0.168053 0.183723 0.157437
charge: -0.200898 0.157241 -0.195314 0.152269 -0.064729 -0.080656 -0.213368 0.154870 0.160216 -0.202334 0.149150 0.153663 -0.220249 0.093314 0.160611 0.154708 0.156685 0.170377 0.160400 0.191112 0.162933
qa: -0.1868 0.1559 -0.1908 0.1657 -0.0739 -0.0739 -0.2091 0.1489 0.1618 -0.2180 0.1445 0.1631 -0.1494 -0.0017 0.1720 0.1507 0.1467 0.1852 0.1681 0.1837 0.1574
va: 3.8486 0.9710 3.8354 0.9706 3.8161 3.8071 3.8870 0.9688 0.9699 3.8488 0.9687 0.9647 3.8634 3.6467 0.9605 0.9733 0.9740 0.9516 0.9689 0.9604 0.9659
dispcorr: -0.036731734 hartree
energy: -312.280379459838
dipole: 0.54986 -0.82479 -0.27493 1.87905 -1.35196 0.52709 0.16022 -0.28756 -0.12734
magnitude: 0.60797 au
magnitude: 1.54533 debye
