program: Orca
programVersion: 5.0.3
elementType: C H C H C C C H H C H H C C H H H H H H H
charge: 1
multiplicity: 1
keywords: DSD-PBEP86/2013 cc-pVTZ EnGrad D3BJ RIJCOSX verytightscf cc-pVTZ/C def2/J soscf
formula: C8H13
InChI: InChI=1/C8H13/c1-2-4-6-8-7-5-3-1/h1-2,7H,3-6,8H2
21 atoms
C  -1.995221 0.537615 0.118954
H  -2.171306 0.726678 1.181607
C  -1.931618 -0.989711 -0.1731
H  -2.67332 -1.574543 0.374354
C  -0.503093 -1.177802 0.293083
C  0.617421 -1.148855 -0.494371
C  1.910879 -0.661294 0.068492
H  2.0208 -0.951276 1.118854
H  2.772209 -1.042598 -0.487237
C  1.877982 0.901107 -0.0480
H  1.981933 1.184825 -1.102089
H  2.72902 1.334438 0.484306
C  0.546851 1.480223 0.497311
C  -0.573104 0.895092 -0.277865
H  0.533382 -1.307423 -1.56921
H  -2.03409 -1.191814 -1.243662
H  0.423874 1.328138 1.574178
H  -0.438927 0.962746 -1.360449
H  -2.740441 1.07935 -0.473624
H  0.553423 2.569211 0.317208
H  -0.356299 -1.130963 1.373666
totalener: -311.16382782 hartree
nucrepener: 384.25037793 hartree
electener: -695.41420575 hartree
oneelecener: -1168.77957931 hartree
twoeener: 473.36537355 hartree
kineticenergy: 309.73477574 hartree
exchangeener: -14.124757878852 hartree
correlationener: -0.946646379717 hartree
xcener: -15.071404258570 hartree
chargesum: 1.0000000
charge: -0.221747 0.169325 -0.229272 0.182826 -0.076133 -0.089608 -0.246887 0.163429 0.181732 -0.246607 0.157455 0.181686 -0.232250 -0.035391 0.220763 0.165925 0.166462 0.208764 0.183015 0.200141 0.196372
charge: 0.091420 0.000674 0.095941 -0.000691 0.127084 0.141763 0.078563 0.000442 0.006105 0.098661 -0.006413 -0.000407 0.064510 0.264668 -0.002296 -0.000005 0.000107 0.004152 0.003510 0.028131 0.004081
qa: -0.2217 0.1693 -0.2293 0.1828 -0.0761 -0.0896 -0.2469 0.1634 0.1817 -0.2466 0.1575 0.1817 -0.2323 -0.0354 0.2208 0.1659 0.1665 0.2088 0.1830 0.2001 0.1964
va: 3.8653 0.9849 3.8852 0.9766 3.8084 3.8072 3.9187 0.9846 0.9768 3.8882 0.9822 0.9725 3.9008 3.6967 0.9625 0.9867 0.9835 0.9716 0.9752 0.9669 0.9780
dispcorr: -0.014184382 hartree
energy: -311.852182712105
dipole: 0.56251 -0.78512 -0.22261 1.85977 -1.59963 0.26013 0.17592 -0.31860 -0.14268
magnitude: 0.37092 au
magnitude: 0.94281 debye
