program: Orca
programVersion: 5.0.3
elementType: C H C H C C C H H C H H C C H H H H H H H
charge: 1
multiplicity: 1
keywords: b3lyp cc-pVTZ EnGrad RIJCOSX verytightscf cc-pVTZ/C def2/J soscf
formula: C8H13
InChI: InChI=1/C8H13/c1-2-4-6-8-7-5-3-1/h1-2,7H,3-6,8H2
21 atoms
C  -1.997114 0.754415 0.072806
H  -2.171925 0.84688 1.147729
C  -1.735646 -0.95428 -0.152379
H  -2.618408 -1.319307 0.377315
C  -0.421834 -1.380591 0.39747
C  0.689862 -1.2810 -0.371401
C  2.004123 -0.688629 0.064554
H  2.21494 -0.880635 1.122322
H  2.857322 -1.030772 -0.526582
C  1.79312 0.874029 -0.144146
H  1.843987 1.126567 -1.208657
H  2.599379 1.416535 0.355828
C  0.421889 1.253249 0.474367
C  -0.764999 1.31018 -0.379136
H  0.526249 -1.210658 -1.45141
H  -1.839077 -1.12255 -1.224889
H  0.158024 0.442276 1.174194
H  -0.651587 1.513781 -1.447665
H  -2.878153 0.985088 -0.525108
H  0.430224 2.098259 1.185317
H  -0.342029 -1.50002 1.478379
totalener: -312.19856784 hartree
nucrepener: 379.92716152 hartree
electener: -692.12572936 hartree
oneelecener: -1160.85877874 hartree
twoeener: 468.73304937 hartree
kineticenergy: 309.97713922 hartree
exchangeener: -36.294122153280 hartree
correlationener: -2.304396771540 hartree
xcener: -38.598518924820 hartree
chargesum: 1.0000000
charge: -0.196239 0.166313 -0.193958 0.174304 -0.115167 -0.082725 -0.172124 0.127181 0.147218 -0.205179 0.133501 0.150801 -0.181017 0.106724 0.136154 0.161905 0.131296 0.193716 0.176403 0.193621 0.147274
charge: 0.131955 0.010778 0.167236 0.007938 0.024825 0.085907 0.082657 -0.006062 -0.004956 0.110637 -0.013581 -0.002517 0.082289 0.296681 -0.017315 -0.002350 0.011144 0.011496 0.005832 0.038650 -0.021242
qa: -0.1962 0.1663 -0.1940 0.1743 -0.1152 -0.0827 -0.1721 0.1272 0.1472 -0.2052 0.1335 0.1508 -0.1810 0.1067 0.1362 0.1619 0.1313 0.1937 0.1764 0.1936 0.1473
va: 3.8340 0.9822 3.8636 0.9727 3.7917 3.7972 3.8531 0.9934 0.9826 3.8470 0.9905 0.9822 3.8192 3.5556 0.9924 0.9817 1.0195 0.9756 0.9786 0.9737 0.9969
energy: -312.198567839827
dipole: 0.12068 -0.93542 -0.81475 1.27839 -0.31286 0.96554 0.42790 -0.50690 -0.07900
magnitude: 1.26583 au
magnitude: 3.21747 debye
