program: Gaussian 09
title: 000050703
version: EM64L-G09RevD.01
frameworkgroup: C1[X(C16H26N2O2)]
method: RPBEPBE
basis: SDD
operation: Freq
keyword: #p
keyword: freq=noraman
keyword: PBEPBE/SDD
title: #p freq=noraman PBEPBE/SDD
converged: YES YES NO NO
title: Mulliken charges:
elementType: O O N N C C C C C C C C C C C C C C C C H H H H H H H H H H H H H H H H H H H H H H H H H H
charge: -0.310893 -0.269363 -0.310010 -0.684712 0.254125 -0.373345 -0.288173 -0.391668 -0.741072 -0.728005 -0.339989 -0.352393 -0.695954 0.194101 0.223992 -0.335942 -0.326904 -0.407830 -0.401989 0.501038 0.250301 0.207194 0.179573 0.234679 0.223332 0.178007 0.209422 0.238650 0.212298 0.216956 0.200054 0.223520 0.232336 0.186909 0.183154 0.195286 0.194256 0.214629 0.209633 0.210438 0.265852 0.255104 0.221478 0.219761 0.310837 0.311329
chargesum: 0.00000
title: Mulliken charges with hydrogens summed into heavy atoms:
elementType: O O N N C C C C C C C C C C C C C C C C
charge: -0.310893 -0.269363 -0.059709 -0.062545 0.254125 0.013422 0.169839 -0.004239 -0.073168 -0.072096 0.030073 0.037148 -0.061255 0.194101 0.223992 -0.070090 -0.071801 -0.186351 -0.182228 0.501038
polarizability: 2.32757060e+02 4.89513672e+01 2.00358658e+02 -1.06985685e+01 -1.48145924e+01 1.82969057e+02
1716.lowfreq: -9.7188 -4.4867 0.0005 0.0007 0.0008 4.0346 9.9802 13.0673 40.5769
frequency: 8.4922 12.7258 40.4002 54.7222 58.8137 64.1220 73.2345 89.7971 107.4425 112.4968 140.8271 164.3042 174.6684 190.7653 199.7119 225.7805 241.3285 242.3681 253.9077 271.2942 292.8909 331.6282 333.7165 360.9293 385.8461 409.3282 410.1738 413.7644 416.6287 456.9372 481.7731 507.9909 509.1504 544.5056 603.8015 634.4296 675.9279 680.6073 729.5881 748.1223 754.5996 765.8344 810.3741 823.7671 834.3912 843.0891 851.7403 881.1730 886.4347 904.6097 930.9438 945.0589 966.6725 970.7681 983.7706 987.4960 998.1785 1004.0354 1017.3995 1022.2337 1055.4901 1057.5211 1078.6949 1092.3276 1120.4742 1130.3004 1136.7711 1171.9018 1177.9926 1196.9983 1209.7316 1232.7422 1249.1477 1255.4685 1263.3655 1265.7143 1282.0894 1290.9208 1307.5028 1312.7304 1324.9411 1340.7302 1350.6236 1364.1111 1375.3407 1388.6343 1391.6147 1392.7904 1448.0118 1450.3723 1463.6427 1465.7846 1467.5953 1468.8792 1470.8464 1477.5876 1478.3334 1481.6804 1487.3847 1493.3940 1496.6223 1517.3798 1570.0294 1611.6159 1632.0370 1646.2210 2861.1229 2953.1048 2958.1369 2968.8238 2971.6962 2983.0098 2985.5780 2994.2310 2999.6787 3009.7564 3021.0232 3042.8585 3062.6731 3069.0648 3070.3337 3076.0987 3081.3979 3091.7925 3097.3597 3123.7533 3126.4991 3158.9268 3171.7015 3415.0309 3560.7523 3700.5019
redmass: 4.7924 4.7167 4.0555 1.7198 3.7266 3.5154 3.3491 4.9597 1.7110 3.5420 2.5777 3.3011 2.6064 2.1340 1.4118 4.1444 1.0975 3.0341 1.1483 4.3194 4.9572 2.2570 3.1551 3.7482 3.0097 2.5568 1.1714 1.2439 2.1369 3.1760 2.8919 2.8269 2.7947 4.2728 6.2952 6.9068 3.9389 1.7101 1.0717 3.8498 4.4248 1.1196 4.1303 1.2718 5.1975 1.8329 1.2152 2.1525 1.8475 2.1598 2.6477 1.6193 1.2305 1.3616 1.3519 1.4713 3.1212 1.9375 1.4785 2.1908 3.9210 3.2275 2.3624 2.2893 2.6200 1.2151 1.7311 1.4952 1.1595 1.7278 1.7254 2.0222 2.1374 1.7112 1.8006 1.5246 1.0583 1.1218 1.3216 1.3670 2.7062 1.6097 1.5503 1.4726 1.2638 1.2193 4.6762 1.2223 4.2014 1.0952 1.1071 1.0687 1.0722 1.0508 1.0725 1.0708 1.0440 1.0949 1.0797 1.0796 1.0916 3.2125 7.3010 10.2911 3.1510 1.4560 1.0706 1.0605 1.0619 1.0589 1.0371 1.0354 1.0363 1.0970 1.0563 1.0866 1.1003 1.1023 1.1069 1.1007 1.0993 1.0995 1.0987 1.1003 1.0997 1.0894 1.0893 1.0953 1.0948 1.0732 1.0450 1.1040
irintensity: 0.7026 0.9843 0.6065 0.4111 1.7401 1.8471 0.7435 0.6491 0.8669 0.8735 0.6339 1.1124 0.8688 1.3288 0.0434 3.7120 0.0166 0.5258 1.2236 4.9696 10.0161 0.8046 1.5264 1.5340 2.1976 1.3862 0.0320 312.3872 0.3671 11.8967 6.6006 2.4478 7.3873 2.6441 14.6120 1.6215 30.2860 100.5795 12.6340 17.1229 11.4379 0.1047 4.3123 1.6048 2.1013 70.1059 2.1629 9.5403 4.2106 2.1386 28.8161 3.2433 5.2414 0.2782 0.2113 2.6262 34.3300 0.9715 15.3620 2.5632 265.0813 137.1358 0.2057 3.2142 15.9122 13.2102 15.9594 17.3694 209.1920 5.0892 42.1535 16.9615 203.4728 75.0919 36.8951 28.5394 0.3737 3.5025 3.0817 0.6574 79.7312 80.7326 1.8854 5.6569 21.9339 11.2898 12.5295 21.8258 6.5014 16.7473 4.0644 0.6289 0.4931 0.0736 17.3302 2.2706 12.4739 19.6738 9.8904 2.0247 17.2547 69.1452 28.1997 336.3091 89.8211 326.8676 73.6124 1.0766 13.8217 90.3397 33.4624 25.7440 16.3971 2.1808 28.6690 30.1931 1.3230 96.0729 11.8958 93.8626 54.2224 29.1712 63.0638 8.9994 53.8222 14.1203 22.3813 9.9156 4.8359 2.2261 110.6711 23.2020
temp: 298.150 k
press: 1.00000 atm
elementType: 8 8 7 7 6 6 6 6 6 6 6 6 6 6 6 6 6 6 6 6 1 1 1 1 1 1 1 1 1 1 1 1 1 1 1 1 1 1 1 1 1 1 1 1 1 1
symmnumber: 1
zpe: 1036782.6 jmol-1
zpe.correction: 0.394890 hartree
zpe.thermalcorrener: 0.417840 hartree
zpe.thermalcorrenthalpy: 0.418784 hartree
zpe.thermalcorrgfe: 0.339489 hartree
zpe.sumelectzpe: -883.705356 hartree
zpe.sumelectthermal: -883.682406 hartree
zpe.sumelectthermalent: -883.681462 hartree
zpe.sumelectthermalfe: -883.760757 hartree
dipole: 2.8674 2.8039 -2.5484
dipole: 4.7516
quadrupole: -95.8689 -114.4919 -125.2549
quadrupole: 20.2597 -11.1828 -2.2291
quadrupole: 16.0030 -2.6200 -13.3830 20.2597 -11.1828 -2.2291
hfenergy: -884.1002459 hartree
pointgroup: C01 [X(C16H26N2O2)]
dipole: 1.1289536 -1.111023 0.992907 debye
polarizability: 234.6923765|-48.0364225|198.9480729|10.7121187|-15.2672593|182.4443264 unknown
InChI: InChI=1S/C16H26N2O2/c1-4-5-6-11-18-16(2,3)12-20-15(19)13-7-9-14(17)10-8-13/h7-10,18H,4-6,11-12,17H2,1-3H3
charge 0 multiplicity 1
46 atoms
O  0.466168 1.491583 -0.078699
O  1.388764 1.450415 -2.222557
N  -2.238714 1.165245 0.92067
N  5.461878 -2.359723 1.138607
C  -1.680849 2.495312 0.532837
C  -2.948811 0.3658 -0.105184
C  -0.605719 2.389034 -0.584441
C  -3.417746 -0.973958 0.498145
C  -2.811704 3.416229 0.012989
C  -1.057983 3.108798 1.810338
C  -4.203317 -1.847712 -0.505201
C  -4.668502 -3.19277 0.098031
C  -5.473009 -4.054095 -0.899527
C  1.42889 1.082829 -1.018509
C  2.452361 0.196234 -0.421917
C  3.477098 -0.317273 -1.263513
C  2.456223 -0.161841 0.954071
C  4.473035 -1.16205 -0.755262
C  3.448687 -1.005818 1.474486
C  4.47642 -1.522614 0.627335
H  -1.492348 0.600437 1.354088
H  -3.835127 0.933293 -0.447082
H  -2.330186 0.150845 -1.012668
H  -1.017582 1.959121 -1.515574
H  -0.160436 3.372526 -0.824839
H  -2.533836 -1.541076 0.861739
H  -4.04305 -0.759279 1.386957
H  -3.633725 3.434101 0.7495
H  -2.439302 4.447431 -0.124975
H  -3.220927 3.072485 -0.954606
H  -0.632833 4.108128 1.60435
H  -0.24491 2.468337 2.197135
H  -1.833278 3.203125 2.589737
H  -3.574657 -2.046179 -1.398489
H  -5.089513 -1.285096 -0.866959
H  -5.285165 -2.993132 0.998147
H  -3.782102 -3.76026 0.448211
H  -5.793634 -5.009477 -0.44456
H  -6.380406 -3.520536 -1.240549
H  -4.868613 -4.292061 -1.795345
H  3.469057 -0.035315 -2.321815
H  1.674354 0.233872 1.608474
H  5.255879 -1.550019 -1.418122
H  3.440112 -1.272387 2.538389
H  5.469604 -2.61791 2.121317
H  6.196153 -2.727196 0.540041
