program: Orca
programVersion: 5.0.3
charge: 1
multiplicity: 1
keywords: DLPNO-CCSD(T1) tightPNO Extrapolate(3/4,def2) RIJK def2/JK verytightSCF miniprint nopop
formula: C8H13
InChI: InChI=1/C8H13/c1-2-4-6-8-7-5-3-1/h1-2,7H,3-6,8H2
21 atoms
C  -1.994473 0.540228 0.117958
H  -2.170257 0.72845 1.180887
C  -1.924098 -0.987495 -0.173652
H  -2.672393 -1.56923 0.368458
C  -0.498485 -1.189205 0.296911
C  0.619555 -1.156466 -0.491149
C  1.912249 -0.664121 0.069294
H  2.025566 -0.950893 1.120178
H  2.775094 -1.041927 -0.48669
C  1.873076 0.89736 -0.051825
H  1.970783 1.178588 -1.107215
H  2.724583 1.336516 0.475039
C  0.54327 1.478854 0.499424
C  -0.580879 0.916959 -0.282132
H  0.533579 -1.308472 -1.566842
H  -2.022688 -1.188092 -1.244943
H  0.418277 1.316486 1.574441
H  -0.445647 0.990663 -1.36431
H  -2.747367 1.072922 -0.473464
H  0.562109 2.570046 0.330664
H  -0.352809 -1.14516 1.377821
e0: -310.319555499 hartree
corrType: DLPNO BASED
e0: -310.333158952 hartree
basis: def2-TZVPP def2-QZVPP
scfener: -310.319555499 -310.333158952
corrmethod: MDCI MDCI
correner: -1.450617599 -1.520829078
corrcbsextra: -1.572837542
energy: -311.907870216480
dipole: 0.56118 -0.91318 -0.35200 1.86270 -1.40223 0.46047 0.17228 -0.36561 -0.19333
magnitude: 0.61099 au
magnitude: 1.55302 debye
