program: Orca
programVersion: 5.0.3
elementType: C H C H C C C H H C H H C C H H H H H H H
charge: 1
multiplicity: 1
keywords: DSD-PBEP86 def2-TZVP RIJCOSX verytightscf def2-TZVP/C def2/J soscf noTRAH
formula: C8H13
InChI: InChI=1/C8H13/c1-2-4-6-8-7-5-3-1/h1-2,7H,3-6,8H2
21 atoms
C  -1.990333 0.560033 0.105409
H  -2.166334 0.743144 1.170146
C  -1.875464 -0.97388 -0.174825
H  -2.663864 -1.531547 0.337143
C  -0.469031 -1.255405 0.324406
C  0.633814 -1.202255 -0.466689
C  1.924825 -0.681544 0.0723
H  2.06341 -0.947232 1.12561
H  2.793175 -1.0383 -0.490606
C  1.845351 0.873335 -0.0776
H  1.909182 1.1409 -1.139059
H  2.693128 1.349646 0.422972
C  0.516384 1.45829 0.509859
C  -0.632681 1.054189 -0.306207
H  0.530865 -1.300428 -1.547927
H  -1.950722 -1.170772 -1.249092
H  0.379964 1.218351 1.567944
H  -0.509309 1.221546 -1.38049
H  -2.786879 1.02946 -0.48322
H  0.607816 2.558179 0.421456
H  -0.333193 -1.243097 1.407416
totalener: -311.16416652 hartree
nucrepener: 381.74697933 hartree
electener: -692.91114586 hartree
oneelecener: -1163.86805646 hartree
twoeener: 470.95691061 hartree
kineticenergy: 309.99767773 hartree
exchangeener: -12.757837115429 hartree
correlationener: -0.944863607669 hartree
xcener: -13.702700723098 hartree
chargesum: 1.0000000
charge: -0.207311 0.171207 -0.206749 0.177630 -0.132587 -0.133398 -0.222158 0.157161 0.169795 -0.239777 0.150825 0.174755 -0.187948 0.070237 0.177125 0.163806 0.161656 0.206101 0.181873 0.199017 0.168740
charge: -0.197178 0.157942 -0.194841 0.150361 -0.089653 -0.107282 -0.217738 0.151352 0.154620 -0.200719 0.145238 0.150400 -0.218251 0.169036 0.156995 0.152699 0.156471 0.173888 0.159509 0.189004 0.158146
qa: -0.2073 0.1712 -0.2067 0.1776 -0.1326 -0.1334 -0.2222 0.1572 0.1698 -0.2398 0.1508 0.1748 -0.1879 0.0702 0.1771 0.1638 0.1617 0.2061 0.1819 0.1990 0.1687
va: 3.8448 0.9694 3.8524 0.9699 3.8644 3.8589 3.8984 0.9714 0.9705 3.8668 0.9715 0.9636 3.8863 3.5633 0.9602 0.9739 0.9734 0.9421 0.9687 0.9587 0.9634
total: -311.845671686 hartree
energy: -311.845671686430
dipole: 0.53154 -0.98706 -0.45552 1.90018 -1.03197 0.86821 0.15189 -0.32454 -0.17265
magnitude: 0.99553 au
magnitude: 2.53045 debye
