program: Orca
programVersion: 5.0.3
elementType: C H C H C C C H H C H H C C H H H H H H H
charge: 1
multiplicity: 1
keywords: DSD-PBEP86 def2-TZVP RIJCOSX verytightscf def2-TZVP/C def2/J soscf noTRAH
formula: C8H13
InChI: InChI=1/C8H13/c1-2-4-6-8-7-5-3-1/h1-2,7H,3-6,8H2
21 atoms
C  -2.002287 0.748589 0.069263
H  -2.165995 0.812579 1.147735
C  -1.731773 -0.975169 -0.165306
H  -2.619813 -1.337002 0.357393
C  -0.411445 -1.385725 0.387881
C  0.681712 -1.271167 -0.387058
C  1.996368 -0.699275 0.062917
H  2.199941 -0.908185 1.118588
H  2.853174 -1.036974 -0.526831
C  1.788007 0.84059 -0.133147
H  1.821748 1.104525 -1.196024
H  2.593044 1.391331 0.360572
C  0.425747 1.289644 0.496447
C  -0.765642 1.290842 -0.358668
H  0.516923 -1.190542 -1.466208
H  -1.829139 -1.135363 -1.239803
H  0.219422 0.741716 1.419163
H  -0.658899 1.633695 -1.391646
H  -2.881602 0.99802 -0.523273
H  0.51051 2.35537 0.805363
H  -0.325572 -1.472508 1.470219
totalener: -311.13780177 hartree
nucrepener: 379.16040477 hartree
electener: -690.29820654 hartree
oneelecener: -1158.76548796 hartree
twoeener: 468.46728142 hartree
kineticenergy: 310.00023519 hartree
exchangeener: -12.754443647146 hartree
correlationener: -0.942859128125 hartree
xcener: -13.697302775271 hartree
chargesum: 1.0000000
charge: -0.279373 0.200239 -0.196682 0.192821 -0.210001 -0.106322 -0.212618 0.154283 0.165483 -0.269588 0.153496 0.170483 -0.156451 0.112514 0.140436 0.187854 0.156623 0.217793 0.196006 0.210962 0.172041
charge: -0.167337 0.169075 -0.112713 0.156588 -0.183057 -0.123794 -0.216532 0.148761 0.148539 -0.201164 0.142569 0.150392 -0.205913 0.147853 0.151340 0.152121 0.165205 0.174719 0.157315 0.197328 0.148707
qa: -0.2794 0.2002 -0.1967 0.1928 -0.2100 -0.1063 -0.2126 0.1543 0.1655 -0.2696 0.1535 0.1705 -0.1565 0.1125 0.1404 0.1879 0.1566 0.2178 0.1960 0.2110 0.1720
va: 3.8809 0.9578 3.8271 0.9583 3.8542 3.8447 3.8735 0.9730 0.9731 3.9054 0.9689 0.9661 3.8012 3.5332 0.9687 0.9586 0.9898 0.9428 0.9653 0.9474 0.9643
total: -311.820071751 hartree
energy: -311.820071750544
dipole: 0.21888 -1.09921 -0.88033 1.83229 -0.54788 1.28441 0.31390 -0.50270 -0.18880
magnitude: 1.56854 au
magnitude: 3.98692 debye
