program: Orca
programVersion: 5.0.3
elementType: C H C H C C C H H C H H C C H H H H H H H
charge: 1
multiplicity: 1
keywords: m062x def2-TZVP EnGrad RIJCOSX verytightscf def2/J soscf
formula: C8H13
InChI: InChI=1/C8H13/c1-2-4-6-8-7-5-3-1/h1-2,7H,3-6,8H2
21 atoms
C  -1.993731 0.542917 0.116685
H  -2.169328 0.730384 1.17987
C  -1.916595 -0.98534 -0.174085
H  -2.671379 -1.563779 0.36289
C  -0.4939 -1.200301 0.300882
C  0.621676 -1.163929 -0.487783
C  1.913745 -0.666894 0.069986
H  2.030603 -0.950456 1.12135
H  2.777913 -1.041283 -0.486484
C  1.868352 0.893629 -0.055685
H  1.960081 1.172481 -1.112266
H  2.72004 1.338571 0.46612
C  0.539552 1.477009 0.501445
C  -0.588693 0.938691 -0.286293
H  0.533556 -1.30894 -1.564343
H  -2.011356 -1.184745 -1.24602
H  0.412613 1.303903 1.574436
H  -0.453185 1.020859 -1.367982
H  -2.754035 1.066339 -0.473836
H  0.570449 2.570174 0.344334
H  -0.349433 -1.159668 1.38213
totalener: -312.30596295 hartree
nucrepener: 383.52363496 hartree
electener: -695.82959792 hartree
oneelecener: -1167.75768486 hartree
twoeener: 471.92808694 hartree
kineticenergy: 310.39018292 hartree
xcener: -23.100030806252 hartree
chargesum: 1.0000000
charge: -0.291029 0.204646 -0.296055 0.201833 -0.085712 -0.079530 -0.333942 0.202996 0.202126 -0.301479 0.200878 0.200259 -0.301973 0.009238 0.209575 0.201387 0.199907 0.227146 0.203563 0.225756 0.200411
charge: -0.206862 0.160177 -0.200694 0.155542 -0.068077 -0.072340 -0.220045 0.159271 0.163050 -0.212016 0.153121 0.156820 -0.230479 0.083174 0.164673 0.158361 0.160338 0.173860 0.162016 0.191729 0.168381
qa: -0.2910 0.2046 -0.2961 0.2018 -0.0857 -0.0795 -0.3339 0.2030 0.2021 -0.3015 0.2009 0.2003 -0.3020 0.0092 0.2096 0.2014 0.1999 0.2271 0.2036 0.2258 0.2004
va: 3.7359 0.9520 3.7358 0.9621 3.6902 3.6492 3.7651 0.9476 0.9585 3.6960 0.9459 0.9558 3.7431 3.4977 0.9482 0.9531 0.9511 0.9333 0.9596 0.9446 0.9487
energy: -312.305962952113
dipole: 0.55903 -0.81965 -0.26062 1.86640 -1.42726 0.43914 0.16869 -0.30884 -0.14015
magnitude: 0.52954 au
magnitude: 1.34598 debye
