program: Orca
programVersion: 5.0.3
elementType: C H C H C C C H H C H H C C H H H H H H H
charge: 1
multiplicity: 1
keywords: b3lyp cc-pVTZ EnGrad RIJCOSX verytightscf cc-pVTZ/C def2/J soscf
formula: C8H13
InChI: InChI=1/C8H13/c1-3-7-5-2-6-8(4-1)9-7/h3,6-8H,1-2,4-5H2
21 atoms
C  -1.996904 0.672268 0.102554
H  -2.192785 0.863771 1.161999
C  -1.823505 -0.93062 -0.131868
H  -2.64137 -1.433736 0.386931
C  -0.453201 -1.335178 0.396384
C  0.689262 -1.272095 -0.366646
C  2.000022 -0.670989 0.0916
H  2.200267 -0.872694 1.148349
H  2.850593 -1.011541 -0.501594
C  1.826562 0.929808 -0.130732
H  1.909393 1.15166 -1.199472
H  2.641096 1.434601 0.391806
C  0.452183 1.320755 0.402351
C  -0.694014 1.285379 -0.357433
H  0.540392 -1.240623 -1.449896
H  -1.908449 -1.142648 -1.202382
H  0.003058 -0.000902 0.138685
H  -0.55427 1.283148 -1.442118
H  -2.853316 1.010742 -0.483321
H  0.345533 1.342883 1.489906
H  -0.345389 -1.382335 1.482963
totalener: -312.18406188 hartree
nucrepener: 382.84391369 hartree
electener: -695.02797557 hartree
oneelecener: -1166.20258945 hartree
twoeener: 471.17461388 hartree
kineticenergy: 309.94802728 hartree
exchangeener: -36.296411677136 hartree
correlationener: -2.309290196198 hartree
xcener: -38.605701873335 hartree
chargesum: 1.0000000
charge: -0.194836 0.144968 -0.201832 0.158345 -0.047896 -0.024993 -0.194324 0.144420 0.158965 -0.201261 0.142355 0.158068 -0.048241 -0.026027 0.154871 0.142785 0.100896 0.156189 0.159079 0.158662 0.159807
charge: 0.111829 -0.004312 0.116664 0.000264 0.130182 0.152336 0.111784 -0.004425 0.001160 0.116645 -0.005250 0.000080 0.128215 0.154179 0.001443 -0.005148 -0.011371 0.000664 0.001235 0.002294 0.001530
qa: -0.1948 0.1450 -0.2018 0.1583 -0.0479 -0.0250 -0.1943 0.1444 0.1590 -0.2013 0.1424 0.1581 -0.0482 -0.0260 0.1549 0.1428 0.1009 0.1562 0.1591 0.1587 0.1598
va: 3.8467 0.9882 3.8589 0.9815 3.7650 3.7632 3.8466 0.9885 0.9809 3.8592 0.9892 0.9816 3.7668 3.7629 0.9937 0.9890 1.1079 0.9928 0.9808 0.9945 0.9937
energy: -312.184061879928
dipole: -0.00488 -0.00291 -0.00779 0.00282 -0.00455 -0.00173 -0.07285 0.05723 -0.01562
magnitude: 0.01754 au
magnitude: 0.04457 debye
