program: Orca
programVersion: 5.0.3
elementType: C H C H C C C H H C H H C C H H H H H H H
charge: 1
multiplicity: 1
keywords: DSD-PBEP86/2013 cc-pVTZ EnGrad D3BJ RIJCOSX verytightscf cc-pVTZ/C def2/J soscf
formula: C8H13
InChI: InChI=1/C8H13/c1-2-4-6-8-7-5-3-1/h1-2,7H,3-6,8H2
21 atoms
C  -1.999455 0.522228 0.115178
H  -2.181722 0.726231 1.173673
C  -1.980634 -1.006446 -0.163189
H  -2.678893 -1.602165 0.425957
C  -0.533323 -1.101191 0.274785
C  0.600479 -1.094806 -0.513122
C  1.904425 -0.640537 0.05714
H  1.998372 -0.955452 1.101847
H  2.749549 -1.045787 -0.505489
C  1.91509 0.926226 -0.021131
H  2.069005 1.233668 -1.061901
H  2.753908 1.319054 0.559361
C  0.566771 1.477881 0.483278
C  -0.522685 0.753976 -0.250775
H  0.521358 -1.286613 -1.582646
H  -2.109626 -1.230853 -1.225802
H  0.454952 1.380423 1.568323
H  -0.409457 0.828807 -1.335573
H  -2.687564 1.113198 -0.496069
H  0.49254 2.54825 0.240466
H  -0.378991 -1.053383 1.353654
totalener: -311.17202105 hartree
nucrepener: 386.75097793 hartree
electener: -697.92299898 hartree
oneelecener: -1173.70508168 hartree
twoeener: 475.78208271 hartree
kineticenergy: 309.75472759 hartree
exchangeener: -14.129954063436 hartree
correlationener: -0.949011362769 hartree
xcener: -15.078965426205 hartree
chargesum: 1.0000000
charge: -0.211226 0.166575 -0.238126 0.183654 -0.051391 -0.044957 -0.249679 0.164113 0.182964 -0.247696 0.160646 0.180816 -0.232881 -0.084600 0.224742 0.167583 0.160416 0.195694 0.181795 0.192451 0.199109
charge: 0.103991 -0.000550 0.106656 -0.001123 0.121597 0.180511 0.085211 0.002049 0.006753 0.097641 -0.006392 -0.000151 0.066066 0.202359 0.004784 -0.000656 -0.002698 0.003078 -0.001185 0.018809 0.013251
qa: -0.2112 0.1666 -0.2381 0.1837 -0.0514 -0.0450 -0.2497 0.1641 0.1830 -0.2477 0.1606 0.1808 -0.2329 -0.0846 0.2247 0.1676 0.1604 0.1957 0.1818 0.1925 0.1991
va: 3.8645 0.9866 3.8856 0.9772 3.7926 3.7704 3.9199 0.9837 0.9766 3.8922 0.9814 0.9734 3.8935 3.7581 0.9599 0.9862 0.9850 0.9806 0.9750 0.9687 0.9786
dispcorr: -0.013737146 hartree
energy: -311.860573882197
dipole: 0.55611 -0.68824 -0.13213 1.84908 -1.88852 -0.03944 0.20209 -0.36885 -0.16676
magnitude: 0.21638 au
magnitude: 0.55001 debye
