program: Orca
programVersion: 5.0.3
elementType: C H C H C C C H H C H H C C H H H H H H H
charge: 1
multiplicity: 1
keywords: m062x def2-TZVP EnGrad RIJCOSX verytightscf def2/J soscf
formula: C8H13
InChI: InChI=1/C8H13/c1-2-4-6-8-7-5-3-1/h1-2,7H,3-6,8H2
21 atoms
C  -1.99269 0.51825 0.069649
H  -2.196727 0.788408 1.10905
C  -2.000089 -1.02298 -0.119069
H  -2.680108 -1.577666 0.528049
C  -0.542919 -1.085099 0.291292
C  0.571486 -1.058323 -0.529243
C  1.901142 -0.628134 0.015016
H  2.023895 -1.001549 1.037413
H  2.718463 -1.022373 -0.594112
C  1.936751 0.938966 0.023169
H  2.144529 1.301075 -0.989878
H  2.749179 1.288196 0.665581
C  0.568035 1.46863 0.491322
C  -0.491057 0.707634 -0.262846
H  0.466894 -1.272934 -1.591773
H  -2.158281 -1.315912 -1.160567
H  0.432478 1.370173 1.573775
H  -0.365556 0.802804 -1.344825
H  -2.648052 1.088987 -0.593289
H  0.469965 2.534897 0.245478
H  -0.363203 -1.028083 1.36546
totalener: -312.32090641 hartree
nucrepener: 387.54035739 hartree
electener: -699.86126379 hartree
oneelecener: -1175.65216313 hartree
twoeener: 475.79089934 hartree
kineticenergy: 310.42142018 hartree
xcener: -23.119259574267 hartree
chargesum: 1.0000000
charge: -0.257912 0.200274 -0.273262 0.199701 -0.070183 -0.010993 -0.332126 0.203017 0.202460 -0.302008 0.198644 0.197671 -0.293818 -0.100537 0.221705 0.195383 0.187885 0.219263 0.196939 0.207006 0.210891
charge: -0.186445 0.158726 -0.184935 0.155011 -0.059494 -0.015744 -0.208958 0.162416 0.163166 -0.215814 0.152844 0.156184 -0.229829 -0.021608 0.170641 0.157801 0.155849 0.181298 0.154144 0.174248 0.180500
qa: -0.2579 0.2003 -0.2733 0.1997 -0.0702 -0.0110 -0.3321 0.2030 0.2025 -0.3020 0.1986 0.1977 -0.2938 -0.1005 0.2217 0.1954 0.1879 0.2193 0.1969 0.2070 0.2109
va: 3.7448 0.9574 3.7607 0.9636 3.7025 3.5835 3.7727 0.9444 0.9585 3.7194 0.9485 0.9590 3.7397 3.6044 0.9398 0.9563 0.9535 0.9346 0.9616 0.9514 0.9431
energy: -312.320906405646
dipole: 0.55616 -0.71514 -0.15897 1.83094 -1.91630 -0.08536 0.23448 -0.40447 -0.16999
magnitude: 0.24790 au
magnitude: 0.63012 debye
