program: Orca
programVersion: 5.0.3
elementType: C H C H C C C H H C H H C C H H H H H H H
charge: 1
multiplicity: 1
keywords: DSD-PBEP86/2013 def2-TZVP RIJCOSX verytightscf def2-TZVP/C def2/J soscf noTRAH
formula: C8H13
InChI: InChI=1/C8H13/c1-2-4-6-8-7-5-3-1/h1-2,7H,3-6,8H2
21 atoms
C  -1.990543 0.558229 0.106697
H  -2.166454 0.741809 1.171262
C  -1.879219 -0.974948 -0.174862
H  -2.664704 -1.534652 0.33919
C  -0.471282 -1.250808 0.322189
C  0.632636 -1.198972 -0.468778
C  1.923572 -0.680235 0.072179
H  2.060033 -0.947555 1.125366
H  2.791743 -1.038542 -0.489889
C  1.847255 0.87517 -0.07558
H  1.913282 1.143654 -1.136695
H  2.695725 1.348638 0.42648
C  0.518708 1.460609 0.509344
C  -0.628586 1.044067 -0.304641
H  0.531239 -1.302022 -1.54962
H  -1.95612 -1.171886 -1.248984
H  0.383102 1.227247 1.569082
H  -0.50331 1.201415 -1.380132
H  -2.784092 1.032735 -0.481952
H  0.605158 2.560161 0.414391
H  -0.334515 -1.235323 1.405064
totalener: -311.16496950 hartree
nucrepener: 381.89273179 hartree
electener: -693.05770129 hartree
oneelecener: -1164.15542146 hartree
twoeener: 471.09772017 hartree
kineticenergy: 309.99793559 hartree
exchangeener: -12.757984919863 hartree
correlationener: -0.944989218040 hartree
xcener: -13.702974137903 hartree
chargesum: 1.0000000
charge: -0.207510 0.170854 -0.206449 0.177693 -0.129581 -0.131727 -0.222466 0.157197 0.170092 -0.239253 0.150786 0.174766 -0.189520 0.066875 0.178412 0.163612 0.161413 0.205404 0.181740 0.198475 0.169186
charge: -0.197321 0.157583 -0.194858 0.150308 -0.087537 -0.104252 -0.217396 0.151456 0.154705 -0.201219 0.145305 0.150397 -0.218734 0.165150 0.157294 0.152687 0.156291 0.173752 0.159279 0.188439 0.158671
qa: -0.2075 0.1709 -0.2064 0.1777 -0.1296 -0.1317 -0.2225 0.1572 0.1701 -0.2393 0.1508 0.1748 -0.1895 0.0669 0.1784 0.1636 0.1614 0.2054 0.1817 0.1985 0.1692
va: 3.8457 0.9697 3.8524 0.9700 3.8633 3.8589 3.8987 0.9713 0.9704 3.8663 0.9716 0.9637 3.8887 3.5696 0.9598 0.9740 0.9732 0.9425 0.9688 0.9590 0.9633
total: -311.846649898 hartree
energy: -311.846649898236
dipole: 0.53515 -0.98035 -0.44519 1.89627 -1.06229 0.83397 0.15308 -0.32533 -0.17224
magnitude: 0.96093 au
magnitude: 2.44248 debye
