program: Gaussian 09
title: 000050717
version: EM64L-G09RevD.01
frameworkgroup: C1[X(C18H28N2O2)]
method: RPBEPBE
basis: SDD
operation: Freq
keyword: #p
keyword: freq=noraman
keyword: PBEPBE/SDD
title: #p freq=noraman PBEPBE/SDD
converged: YES YES NO NO
title: Mulliken charges:
elementType: O O N N C C C C C C C C C C C C C C C C C C H H H H H H H H H H H H H H H H H H H H H H H H H H H H
charge: -0.291568 -0.272681 -0.347374 -0.684675 0.385122 -0.472788 -0.482185 -0.024561 -0.037277 -0.495545 -0.756268 -0.756801 -0.751857 -0.372280 -0.311741 0.176342 0.228807 -0.337131 -0.326287 -0.405431 -0.400280 0.500074 0.192625 0.188503 0.212540 0.195098 0.210131 0.202131 0.204302 0.186993 0.207639 0.210438 0.216233 0.208699 0.213042 0.210322 0.214273 0.213865 0.210003 0.248150 0.214323 0.227743 0.217388 0.238443 0.265012 0.267137 0.220752 0.219387 0.310477 0.310736
chargesum: 0.00000
title: Mulliken charges with hydrogens summed into heavy atoms:
elementType: O O N N C C C C C C C C C C C C C C C C C C
charge: -0.291568 -0.272681 -0.099224 -0.063462 0.385122 -0.091660 -0.074547 0.185570 0.164854 -0.104250 -0.121958 -0.124739 -0.113716 0.069786 0.144090 0.176342 0.228807 -0.072119 -0.059150 -0.184679 -0.180893 0.500074
polarizability: 3.14247754e+02 -3.27293825e+01 2.03463065e+02 -2.24430251e+01 -1.52003543e+01 1.62961284e+02
1716.lowfreq: -11.2495 0.0001 0.0009 0.0014 3.3474 6.9447 13.4101 19.2720 26.6245
frequency: -1.6674 18.6075 26.2148 54.9345 59.6828 74.5981 109.3814 121.8451 123.8782 141.9280 151.4527 170.5113 179.8516 203.1652 221.0690 227.6660 258.3045 263.0361 289.0834 308.7273 311.4073 311.9817 344.3590 368.2785 389.5654 404.0909 409.3514 413.7088 414.5826 417.4550 438.6477 449.6061 478.1976 482.6039 507.6600 524.5290 554.2166 614.2300 633.2164 676.8382 687.4460 737.2261 754.8767 770.9570 816.1517 825.2580 827.3049 843.7392 845.7656 854.7397 858.5782 895.4168 916.3774 921.8297 929.1212 948.1095 969.2424 975.6355 980.7527 984.1737 997.4976 1006.1951 1017.6966 1026.0396 1044.8616 1047.8501 1067.3642 1079.8328 1087.8920 1104.1367 1130.1696 1134.0103 1143.6766 1174.9025 1180.4992 1185.8317 1194.4865 1216.9790 1242.7583 1256.4566 1268.4712 1271.4648 1277.5231 1286.2375 1294.2773 1305.5806 1308.9929 1321.3178 1325.7138 1336.5374 1343.5024 1348.6395 1362.2515 1375.3388 1385.4455 1389.5649 1391.9998 1394.0421 1447.7660 1449.4381 1449.8492 1453.0700 1462.4417 1465.5857 1469.4474 1473.7303 1476.4279 1477.4323 1480.0537 1488.3956 1491.4086 1517.0144 1570.3840 1612.9237 1631.6835 1646.6999 2855.7453 2904.0602 2945.1546 2950.9578 2957.8660 2961.0873 2964.8189 2967.5455 2972.8153 3005.9587 3014.0490 3018.8680 3027.8376 3049.0722 3054.8039 3059.4508 3060.8041 3061.5877 3063.7752 3077.1092 3116.1986 3123.5084 3126.3336 3158.6904 3175.1081 3410.3638 3560.7437 3700.5640
redmass: 3.9628 4.9946 4.3129 3.9835 4.0343 4.5380 5.3944 2.9815 2.3262 3.0157 2.4815 1.2349 2.3837 3.7795 1.0912 1.1835 2.3292 2.6265 3.6581 4.0935 2.7022 2.7288 3.8733 3.4192 3.3119 2.5205 1.1848 1.4539 2.3721 1.7323 1.8941 3.6557 3.0013 2.6458 2.8557 2.7287 4.0495 5.6379 6.9012 4.0594 1.4103 3.5553 4.5194 2.8814 2.0354 1.2649 2.2475 1.8428 2.1284 1.6081 1.5965 2.2034 2.0225 5.2699 1.4708 1.8743 1.6290 1.3562 1.5766 1.3487 3.1886 1.4975 1.4918 1.9808 2.6572 2.1687 3.5775 2.4554 1.4522 1.4809 1.2156 3.6883 2.0245 2.3084 1.1554 2.1028 2.1498 1.2616 1.9129 2.9833 1.3790 1.3106 1.2902 1.2896 1.6173 1.3104 1.3162 1.3746 2.8723 1.4793 1.4349 1.5887 1.4620 1.2112 1.2336 1.4362 4.1311 1.2157 3.5759 1.1643 1.0837 1.0819 1.0819 1.0499 1.2156 1.0730 1.0550 1.0605 1.0614 1.0593 1.0817 3.1490 7.1825 9.1515 3.2823 1.4311 1.0808 1.0704 1.0612 1.0598 1.0780 1.0372 1.0372 1.0512 1.0423 1.1012 1.1016 1.0627 1.1018 1.0872 1.0996 1.0994 1.0989 1.0987 1.0991 1.0970 1.1046 1.0895 1.0893 1.0954 1.0947 1.0737 1.0450 1.1040
irintensity: 0.3946 1.4849 1.0243 1.1086 1.1933 0.8042 0.7119 0.5253 0.5626 2.3430 0.1268 0.3091 1.4714 0.5575 0.0245 0.0635 0.7810 1.7103 4.2721 8.7142 3.1182 3.7412 5.5099 11.9027 13.3749 5.7980 126.3135 163.1088 4.0828 16.5694 2.7899 1.1749 1.5244 14.1845 2.2032 3.2655 7.2473 6.5305 2.2545 33.3141 61.9788 20.6830 13.7187 2.4978 1.3627 0.4299 0.3995 72.3839 1.5766 5.5831 1.3128 5.7493 0.4447 18.4480 1.1413 12.0390 1.6081 0.3647 3.7379 0.0887 42.6876 0.4271 15.4519 4.9404 150.3915 101.1158 149.9944 17.5248 5.3958 17.5177 15.6818 91.9677 5.8749 2.0456 173.5463 4.7264 3.7694 7.3814 15.3224 323.3424 5.9587 0.2375 19.2077 10.9895 3.1297 3.5833 1.3036 3.4311 130.9475 0.5815 1.7000 10.8325 65.1475 21.0708 4.6763 5.4723 13.4429 12.4179 13.7522 16.5834 1.3068 8.2566 5.9857 0.6708 20.2760 5.8416 23.0369 8.5720 8.6355 17.3107 6.7857 63.4270 29.2471 361.9458 98.7054 318.7125 61.7959 74.6033 33.8004 32.5765 22.8175 35.4578 68.1478 47.9881 19.9599 28.8493 34.5586 37.4634 42.3759 21.4755 0.7962 16.2695 89.3608 75.1426 69.0459 48.6451 16.5191 16.0304 23.0118 9.1438 3.4745 2.5061 113.7777 23.0801
temp: 298.150 k
press: 1.00000 atm
elementType: 8 8 7 7 6 6 6 6 6 6 6 6 6 6 6 6 6 6 6 6 6 6 1 1 1 1 1 1 1 1 1 1 1 1 1 1 1 1 1 1 1 1 1 1 1 1 1 1 1 1
symmnumber: 1
zpe: 1131821.8 jmol-1
zpe.correction: 0.431088 hartree
zpe.thermalcorrener: 0.453536 hartree
zpe.thermalcorrenthalpy: 0.454481 hartree
zpe.thermalcorrgfe: 0.379295 hartree
zpe.sumelectzpe: -960.980587 hartree
zpe.sumelectthermal: -960.958139 hartree
zpe.sumelectthermalent: -960.957194 hartree
zpe.sumelectthermalfe: -961.032380 hartree
dipole: -3.1590 2.6694 0.8174
dipole: 4.2158
quadrupole: -81.3087 -133.6193 -135.2052
quadrupole: -17.1332 -5.1812 -1.9485
quadrupole: 35.4024 -16.9082 -18.4942 -17.1332 -5.1812 -1.9485
hfenergy: -961.4116751 hartree
pointgroup: C01 [X(C18H28N2O2)]
dipole: -1.2759811 1.0596214 0.0100307 debye
polarizability: 316.1797051|-34.3603221|189.0364871|-12.6404018|-23.9494906|175.4559117 unknown
InChI: InChI=1S/C18H28N2O2/c1-13-10-16(12-18(2,3)11-13)20-8-9-22-17(21)14-4-6-15(19)7-5-14/h4-7,13,16,20H,8-12,19H2,1-3H3
charge 0 multiplicity 1
50 atoms
O  -1.838639 -0.699224 -0.990983
O  -2.194089 -1.976706 0.936373
N  1.865619 -1.074563 -0.392956
N  -7.825127 1.228777 0.286858
C  4.634541 1.680257 -0.368753
C  5.816225 0.692603 -0.13198
C  3.379734 0.870179 -0.813573
C  5.481777 -0.476572 0.827854
C  3.007207 -0.284791 0.147176
C  4.220057 -1.224182 0.331187
C  4.341122 2.505749 0.914903
C  5.018256 2.665404 -1.503519
C  6.680403 -1.439985 0.971161
C  0.530753 -0.448664 -0.278712
C  -0.474856 -1.28057 -1.092078
C  -2.617533 -1.13505 0.099151
C  -3.953288 -0.501403 0.115581
C  -4.8573 -0.848258 1.157076
C  -4.369704 0.43763 -0.867641
C  -6.137099 -0.280651 1.219841
C  -5.648381 1.011764 -0.8148
C  -6.556533 0.66211 0.23137
H  6.693848 1.252168 0.252356
H  6.116981 0.261265 -1.111298
H  3.566422 0.418381 -1.808937
H  2.525186 1.566206 -0.931243
H  5.261256 -0.056791 1.832262
H  2.748346 0.147128 1.147244
H  4.437402 -1.705393 -0.645636
H  3.961463 -2.035367 1.044353
H  5.22133 3.11755 1.190668
H  3.489375 3.192711 0.749209
H  4.09168 1.868172 1.781228
H  5.920916 3.247614 -1.235635
H  5.229405 2.124161 -2.445469
H  4.199285 3.383428 -1.701618
H  7.577381 -0.910287 1.343658
H  6.45523 -2.262861 1.675642
H  6.937998 -1.893336 -0.00571
H  1.857404 -2.018746 0.021435
H  0.57457 0.571275 -0.699441
H  0.167776 -0.36125 0.772612
H  -0.503506 -2.324268 -0.727521
H  -0.229615 -1.255421 -2.164606
H  -4.528883 -1.572357 1.910318
H  -3.676602 0.705156 -1.67011
H  -6.823468 -0.558281 2.028949
H  -5.957711 1.73403 -1.580113
H  -8.129123 1.897991 -0.414676
H  -8.474689 0.981666 1.028144
