program: Orca
programVersion: 5.0.3
elementType: C H C H C C C H H C H H C C H H H H H H H
charge: 1
multiplicity: 1
keywords: DSD-PBEP86 cc-pVTZ EnGrad RIJCOSX verytightscf cc-pVTZ/C def2/J soscf
formula: C8H13
InChI: InChI=1/C8H13/c1-2-4-6-8-7-5-3-1/h1-2,7H,3-6,8H2
21 atoms
C  -1.992145 0.594858 0.086654
H  -2.169817 0.767721 1.15442
C  -1.824091 -0.957262 -0.172548
H  -2.649435 -1.483708 0.315425
C  -0.438737 -1.310247 0.353166
C  0.652091 -1.240618 -0.437149
C  1.947656 -0.698307 0.072268
H  2.116063 -0.943346 1.126022
H  2.815366 -1.03504 -0.505152
C  1.822499 0.849781 -0.102607
H  1.864576 1.108581 -1.166831
H  2.65496 1.363283 0.386721
C  0.48087 1.415081 0.509808
C  -0.688948 1.174377 -0.322497
H  0.524977 -1.261155 -1.521682
H  -1.882465 -1.152738 -1.248133
H  0.331212 1.084936 1.540414
H  -0.594307 1.479776 -1.369577
H  -2.823026 0.994399 -0.503798
H  0.62169 2.515854 0.512401
H  -0.318097 -1.347959 1.436846
totalener: -311.15058887 hartree
nucrepener: 380.20069652 hartree
electener: -691.35128539 hartree
oneelecener: -1160.78774620 hartree
twoeener: 469.43646081 hartree
kineticenergy: 309.72225966 hartree
exchangeener: -12.753573451590 hartree
correlationener: -0.943290530760 hartree
xcener: -13.696863982350 hartree
chargesum: 1.0000000
charge: -0.229933 0.183948 -0.236940 0.183818 -0.144540 -0.157738 -0.239333 0.165610 0.180791 -0.248597 0.159781 0.183419 -0.237041 0.063732 0.193451 0.169743 0.174670 0.239253 0.190038 0.214795 0.191074
charge: 0.093911 0.010853 0.096857 0.000905 0.080323 0.059312 0.069958 -0.001591 0.005085 0.112308 -0.007810 -0.000023 0.074402 0.355994 -0.015466 0.000174 0.005422 0.019566 0.010240 0.045189 -0.015610
qa: -0.2299 0.1839 -0.2369 0.1838 -0.1445 -0.1577 -0.2393 0.1656 0.1808 -0.2486 0.1598 0.1834 -0.2370 0.0637 0.1935 0.1697 0.1747 0.2393 0.1900 0.2148 0.1911
va: 3.8575 0.9776 3.9108 0.9730 3.8346 3.8458 3.9074 0.9849 0.9762 3.8825 0.9824 0.9716 3.9141 3.5342 0.9740 0.9830 0.9854 0.9519 0.9754 0.9644 0.9793
energy: -311.849721303841
dipole: 0.46068 -0.94894 -0.48825 1.95718 -0.82298 1.13420 0.14699 -0.28243 -0.13544
magnitude: 1.24224 au
magnitude: 3.15751 debye
