program: Orca
programVersion: 5.0.3
elementType: C H C H C C C H H C H H C C H H H H H H H
charge: 1
multiplicity: 1
keywords: b3lyp def2-TZVP EnGrad D3BJ RIJCOSX verytightscf def2/J soscf
formula: C8H13
InChI: InChI=1/C8H13/c1-2-4-6-8-7-5-3-1/h1-2,7H,3-6,8H2
21 atoms
C  -2.001764 0.752252 0.069165
H  -2.164417 0.815853 1.147761
C  -1.730751 -0.974382 -0.164098
H  -2.619331 -1.332284 0.36024
C  -0.412123 -1.386603 0.388901
C  0.682611 -1.271953 -0.385202
C  1.997516 -0.697756 0.062722
H  2.202014 -0.904417 1.118685
H  2.85381 -1.036509 -0.527019
C  1.787761 0.843258 -0.134536
H  1.822322 1.107073 -1.19739
H  2.592337 1.39404 0.359869
C  0.424648 1.283483 0.495682
C  -0.766325 1.292679 -0.36163
H  0.517604 -1.192091 -1.464391
H  -1.829787 -1.133964 -1.238435
H  0.214137 0.714586 1.404848
H  -0.659065 1.629588 -1.396462
H  -2.882418 0.997732 -0.522861
H  0.503054 2.339998 0.835212
H  -0.327217 -1.4754 1.471163
totalener: -312.21456564 hartree
nucrepener: 379.20860438 hartree
electener: -691.42317002 hartree
oneelecener: -1159.51102675 hartree
twoeener: 468.08785672 hartree
kineticenergy: 310.53553741 hartree
exchangeener: -36.318381089206 hartree
correlationener: -2.303193835598 hartree
xcener: -38.621574924804 hartree
chargesum: 1.0000000
charge: -0.235146 0.187839 -0.200632 0.184565 -0.173615 -0.062130 -0.207190 0.145101 0.154888 -0.250023 0.146555 0.159674 -0.128343 0.085540 0.125148 0.179021 0.145069 0.202255 0.183997 0.199488 0.157937
charge: -0.158661 0.171492 -0.113828 0.161494 -0.179806 -0.116802 -0.218355 0.151002 0.151402 -0.201322 0.145773 0.153936 -0.203183 0.095271 0.152552 0.154658 0.168068 0.171919 0.160148 0.204719 0.149524
qa: -0.2351 0.1878 -0.2006 0.1846 -0.1736 -0.0621 -0.2072 0.1451 0.1549 -0.2500 0.1466 0.1597 -0.1283 0.0855 0.1251 0.1790 0.1451 0.2023 0.1840 0.1995 0.1579
va: 3.8621 0.9590 3.8108 0.9570 3.8212 3.7967 3.8601 0.9705 0.9724 3.8960 0.9672 0.9658 3.7719 3.5856 0.9693 0.9596 0.9946 0.9499 0.9661 0.9506 0.9680
dispcorr: -0.036628469 hartree
energy: -312.251194112886
dipole: 0.20886 -1.05282 -0.84396 1.80194 -0.64740 1.15454 0.32886 -0.45498 -0.12611
magnitude: 1.43566 au
magnitude: 3.64917 debye
