program: Orca
programVersion: 5.0.3
elementType: C H C H C C C H H C H H C C H H H H H H H
charge: 1
multiplicity: 1
keywords: PBE0 cc-pVTZ EnGrad RIJCOSX verytightscf cc-pVTZ/C def2/J soscf
formula: C8H13
InChI: InChI=1/C8H13/c1-2-4-6-8-7-5-3-1/h1-2,7H,3-6,8H2
21 atoms
C  -1.988532 0.663241 0.110941
H  -2.168471 0.854789 1.173318
C  -1.835891 -0.938783 -0.127519
H  -2.647463 -1.438467 0.404418
C  -0.460823 -1.338623 0.387067
C  0.682251 -1.267434 -0.373005
C  1.9903 -0.663297 0.099357
H  2.174522 -0.864584 1.159207
H  2.847697 -1.011216 -0.479604
C  1.837088 0.939035 -0.125473
H  1.934257 1.161892 -1.192754
H  2.647828 1.436986 0.409406
C  0.460952 1.329959 0.395301
C  -0.685187 1.275282 -0.361827
H  0.544876 -1.258348 -1.457886
H  -1.935697 -1.15181 -1.196538
H  0.001485 0.000414 0.069903
H  -0.553743 1.284371 -1.447328
H  -2.849771 1.013061 -0.461097
H  0.348686 1.328201 1.482457
H  -0.346488 -1.354411 1.473981
totalener: -312.01727041 hartree
nucrepener: 382.88822139 hartree
electener: -694.90549181 hartree
oneelecener: -1166.25053653 hartree
twoeener: 471.34504472 hartree
kineticenergy: 309.60541575 hartree
exchangeener: -34.146661778008 hartree
correlationener: -1.976973596284 hartree
xcener: -36.123635374292 hartree
chargesum: 1.0000000
charge: -0.196066 0.150074 -0.200106 0.159228 -0.048841 -0.035978 -0.195612 0.149782 0.159454 -0.199721 0.148551 0.159125 -0.048934 -0.035734 0.159639 0.148787 0.083070 0.160226 0.159534 0.161560 0.161964
charge: 0.109189 -0.002078 0.111909 0.002558 0.132368 0.144452 0.109181 -0.002156 0.003010 0.111981 -0.002543 0.002481 0.131771 0.145743 0.003857 -0.002499 -0.014133 0.003573 0.003082 0.004342 0.003911
qa: -0.1961 0.1501 -0.2001 0.1592 -0.0488 -0.0360 -0.1956 0.1498 0.1595 -0.1997 0.1486 0.1591 -0.0489 -0.0357 0.1596 0.1488 0.0831 0.1602 0.1595 0.1616 0.1620
va: 3.8780 0.9903 3.8849 0.9861 3.7927 3.7935 3.8780 0.9904 0.9858 3.8849 0.9911 0.9862 3.7934 3.7928 0.9949 0.9910 1.1488 0.9946 0.9858 0.9954 0.9951
energy: -312.017270413594
dipole: -0.00210 -0.00201 -0.00410 0.00156 -0.00004 0.00151 -0.05811 0.04696 -0.01115
magnitude: 0.01198 au
magnitude: 0.03044 debye
