program: Orca
programVersion: 5.0.3
charge: 1
multiplicity: 1
keywords: DLPNO-CCSD(T1) tightPNO Extrapolate(3/4,def2) RIJK def2/JK verytightSCF miniprint nopop
formula: C8H13
InChI: InChI=1/C8H12.H/c1-2-4-6-8-7-5-3-1;/h1-2,7-8H,3-6H2;
21 atoms
C  -1.982255 0.65804 0.117092
H  -2.149551 0.849552 1.181618
C  -1.843332 -0.944021 -0.123823
H  -2.65064 -1.440419 0.417651
C  -0.46539 -1.342671 0.380296
C  0.67756 -1.263252 -0.378552
C  1.983096 -0.658712 0.105221
H  2.154188 -0.859768 1.167393
H  2.846063 -1.011422 -0.462468
C  1.843808 0.944671 -0.121309
H  1.952213 1.167941 -1.187387
H  2.651524 1.437629 0.422719
C  0.466224 1.336778 0.389917
C  -0.679675 1.268392 -0.366187
H  0.547446 -1.264029 -1.464184
H  -1.954702 -1.157391 -1.191602
H  0.000677 0.001767 0.03262
H  -0.553923 1.281958 -1.452198
H  -2.847783 1.014456 -0.444313
H  0.350159 1.326738 1.476332
H  -0.346542 -1.345174 1.466979
e0: -310.241146038 hartree
corrType: DLPNO BASED
e0: -310.254725045 hartree
basis: def2-TZVPP def2-QZVPP
scfener: -310.241146038 -310.254725044
corrmethod: MDCI MDCI
correner: -1.473705883 -1.544062722
corrcbsextra: -1.596178861
energy: -311.852774259538
dipole: -0.00077 -0.00220 -0.00297 0.00256 0.00409 0.00665 -0.03398 0.02125 -0.01272
magnitude: 0.01466 au
magnitude: 0.03727 debye
