program: Orca
programVersion: 5.0.3
elementType: C H C H C C C H H C H H C C H H H H H H H
charge: 1
multiplicity: 1
keywords: PBE0 cc-pVTZ EnGrad RIJCOSX verytightscf cc-pVTZ/C def2/J soscf
formula: C8H13
InChI: InChI=1/C8H13/c1-2-4-6-8-7-5-3-1/h1-2,7H,3-6,8H2
21 atoms
C  -2.006342 0.696513 0.088695
H  -2.217558 0.878759 1.146578
C  -1.791339 -0.920639 -0.138508
H  -2.625917 -1.408597 0.368296
C  -0.436944 -1.339212 0.410448
C  0.698936 -1.279955 -0.361726
C  2.010422 -0.684096 0.078725
H  2.224485 -0.882339 1.133567
H  2.857425 -1.01475 -0.525267
C  1.80882 0.911059 -0.138895
H  1.872525 1.13569 -1.208513
H  2.625999 1.427988 0.367371
C  0.433965 1.299085 0.416659
C  -0.71675 1.307741 -0.357984
H  0.531447 -1.202853 -1.440463
H  -1.865782 -1.130927 -1.20969
H  0.015839 0.049279 0.366578
H  -0.564058 1.276896 -1.441024
H  -2.862346 1.004668 -0.51362
H  0.343687 1.453575 1.495649
H  -0.345059 -1.475797 1.490297
totalener: -312.01333448 hartree
nucrepener: 382.47480231 hartree
electener: -694.48813679 hartree
oneelecener: -1165.51107171 hartree
twoeener: 471.02293492 hartree
kineticenergy: 309.59518499 hartree
exchangeener: -34.142779917071 hartree
correlationener: -1.975186769462 hartree
xcener: -36.117966686533 hartree
chargesum: 1.0000000
charge: -0.189511 0.151694 -0.211751 0.159333 -0.070104 -0.032211 -0.186221 0.147079 0.158786 -0.205639 0.147277 0.157561 -0.072776 -0.005883 0.157251 0.150215 0.083820 0.164299 0.162517 0.168217 0.166046
charge: 0.107664 -0.000686 0.116967 0.002430 0.100043 0.150846 0.101032 -0.001734 0.002442 0.116201 -0.003868 0.001396 0.114702 0.182781 0.000703 -0.003706 -0.009354 0.005174 0.003910 0.011407 0.001650
qa: -0.1895 0.1517 -0.2118 0.1593 -0.0701 -0.0322 -0.1862 0.1471 0.1588 -0.2056 0.1473 0.1576 -0.0728 -0.0059 0.1573 0.1502 0.0838 0.1643 0.1625 0.1682 0.1660
va: 3.8637 0.9901 3.9040 0.9861 3.7866 3.7984 3.8674 0.9916 0.9846 3.9013 0.9917 0.9874 3.7856 3.7698 0.9932 0.9903 1.1279 0.9906 0.9844 0.9947 0.9938
energy: -312.013334476548
dipole: -0.00872 -0.07864 -0.08736 0.10488 0.03415 0.13903 0.02804 -0.05245 -0.02441
magnitude: 0.16600 au
magnitude: 0.42195 debye
