program: Orca
programVersion: 5.0.3
elementType: C H C H C C C H H C H H C C H H H H H H H
charge: 1
multiplicity: 1
keywords: DSD-PBEP86 cc-pVTZ EnGrad RIJCOSX verytightscf cc-pVTZ/C def2/J soscf
formula: C8H13
InChI: InChI=1/C8H13/c1-2-4-6-8-7-5-3-1/h1-2,7H,3-6,8H2
21 atoms
C  -1.993404 0.603596 0.083962
H  -2.171306 0.772838 1.152428
C  -1.815345 -0.95462 -0.172091
H  -2.646606 -1.474059 0.31352
C  -0.43384 -1.318501 0.357347
C  0.655401 -1.245669 -0.432319
C  1.95231 -0.700648 0.071934
H  2.125386 -0.942651 1.125605
H  2.819561 -1.034548 -0.507901
C  1.819062 0.84633 -0.105991
H  1.858983 1.104574 -1.170345
H  2.648171 1.365491 0.382961
C  0.474541 1.406079 0.508592
C  -0.698092 1.190346 -0.324504
H  0.523862 -1.251838 -1.516823
H  -1.872763 -1.149399 -1.247766
H  0.321928 1.06235 1.534149
H  -0.606561 1.513009 -1.366677
H  -2.828964 0.991391 -0.507084
H  0.619142 2.506734 0.52605
H  -0.316254 -1.364367 1.440921
totalener: -311.14928138 hartree
nucrepener: 380.02021901 hartree
electener: -691.16950039 hartree
oneelecener: -1160.43253533 hartree
twoeener: 469.26303494 hartree
kineticenergy: 309.72203699 hartree
exchangeener: -12.753433725589 hartree
correlationener: -0.943160814871 hartree
xcener: -13.696594540460 hartree
chargesum: 1.0000000
charge: -0.230963 0.185277 -0.238823 0.184223 -0.149166 -0.159218 -0.238495 0.165369 0.180432 -0.248718 0.159966 0.183273 -0.237478 0.071103 0.190111 0.170696 0.174691 0.240639 0.190826 0.215227 0.191027
charge: 0.096022 0.011921 0.099704 0.001111 0.074561 0.054919 0.069786 -0.001780 0.004720 0.113218 -0.008016 -0.000057 0.075677 0.358371 -0.016248 0.000002 0.005785 0.020625 0.010319 0.046349 -0.016988
qa: -0.2310 0.1853 -0.2388 0.1842 -0.1492 -0.1592 -0.2385 0.1654 0.1804 -0.2487 0.1600 0.1833 -0.2375 0.0711 0.1901 0.1707 0.1747 0.2406 0.1908 0.2152 0.1910
va: 3.8581 0.9771 3.9130 0.9726 3.8338 3.8462 3.9063 0.9850 0.9762 3.8821 0.9824 0.9716 3.9149 3.5244 0.9751 0.9823 0.9859 0.9511 0.9754 0.9644 0.9792
energy: -311.848247533977
dipole: 0.44462 -0.96204 -0.51742 1.96555 -0.77101 1.19454 0.14883 -0.28493 -0.13609
magnitude: 1.30888 au
magnitude: 3.32692 debye
