program: Gaussian 09
title: 000050650
version: EM64L-G09RevD.01
frameworkgroup: C1[X(C12H17ClN4)]
method: RPBEPBE
basis: SDD
operation: Freq
keyword: #p
keyword: freq=noraman
keyword: PBEPBE/SDD
title: #p freq=noraman PBEPBE/SDD
converged: YES YES NO NO
title: Mulliken charges:
elementType: Cl N N N N C C C C C C C C C C C C H H H H H H H H H H H H H H H H H
charge: -0.080946 -0.104179 -0.198890 -0.053839 -0.104777 -0.381480 -0.405429 -0.330486 -0.339032 0.324827 -0.573420 -0.665613 -0.040131 -0.322774 -0.274455 -0.199547 -0.220063 0.219451 0.243195 0.259720 0.217478 0.234775 0.231553 0.203535 0.208682 0.268410 0.272087 0.217357 0.224667 0.213470 0.239332 0.255826 0.228113 0.232580
chargesum: 0.00000
title: Mulliken charges with hydrogens summed into heavy atoms:
elementType: Cl N N N N C C C C C C C C C C C C
charge: -0.080946 -0.104179 -0.198890 -0.053839 -0.104777 0.081167 0.071769 0.135843 0.073185 0.324827 -0.032922 -0.010118 -0.040131 -0.083443 -0.018629 0.028566 0.012517
polarizability: 2.29080438e+02 1.17730874e+01 1.72238554e+02 -1.63441836e+01 -5.13927754e+00 1.03724277e+02
1716.lowfreq: -15.6940 -6.7244 -5.3016 -1.8202 0.0013 0.0017 0.0021 9.0254 30.1832
frequency: -5.4314 6.9680 29.8552 38.6772 50.0070 74.6272 86.2615 144.9020 182.9183 207.0920 218.6301 226.2837 243.4336 259.5178 303.1125 355.3540 374.9039 426.3232 433.2896 457.5646 485.7406 532.3555 573.3017 605.0007 633.9431 651.9261 728.4723 751.1223 753.3282 761.3712 766.7359 780.7555 792.2792 801.3415 854.8071 883.6858 906.6070 946.3474 955.2463 983.5281 1002.7205 1004.3649 1034.0828 1055.0006 1074.8234 1080.3827 1087.3736 1089.5260 1127.2959 1128.7138 1164.9373 1175.3569 1216.7179 1219.1361 1227.7889 1244.5097 1267.3538 1281.8703 1290.5637 1303.7525 1307.0577 1323.7887 1357.3012 1366.0795 1377.1837 1381.8567 1389.9812 1413.2392 1446.2387 1448.6132 1456.3605 1463.8270 1474.4747 1477.6893 1479.9227 1482.3629 1489.1554 1587.2827 1621.6401 2882.7236 2904.3881 2955.2157 2983.7100 3015.8051 3019.6607 3044.8321 3051.7323 3060.6849 3078.2194 3091.4936 3100.1498 3134.1046 3148.4320 3149.3536 3162.1769 3178.3384
redmass: 6.3788 5.9195 3.4858 3.9915 3.5663 3.0476 2.8998 2.0466 4.1642 4.7233 5.7610 1.8162 2.3764 1.7259 3.8856 4.2867 3.1487 2.9147 3.0127 4.8723 3.0092 5.9817 4.0289 5.6293 7.7682 6.4661 4.2661 3.1499 2.0989 1.5133 1.1436 2.2442 1.5792 1.8473 1.4148 4.5079 5.5900 1.3676 2.0973 1.3089 1.8541 1.8821 2.9463 3.3825 1.8024 2.9156 3.0499 2.3234 1.5443 1.5521 1.2979 2.6283 2.6410 3.5573 1.7567 1.2090 1.4349 1.1827 1.5447 1.1726 1.3324 1.3626 1.3261 1.3671 1.5206 2.5380 1.2325 3.1580 2.8323 1.1678 1.2239 1.0551 1.0734 1.6491 1.5250 1.0738 1.0751 7.2835 7.6457 1.0704 1.0697 1.0669 1.0356 1.0885 1.0649 1.0902 1.0931 1.0587 1.0989 1.1007 1.1024 1.0859 1.0905 1.1123 1.0963 1.0990
irintensity: 0.4620 0.4967 0.4958 0.9173 0.5532 0.2781 1.9570 1.3066 2.4797 5.4872 0.7314 1.0914 2.0485 1.3010 2.2494 2.4242 13.4671 6.8861 0.8424 1.4010 6.5147 1.9330 1.1754 3.9459 5.0892 97.8307 11.2764 13.8334 22.2011 74.9032 5.8340 18.8637 3.6847 6.4238 0.6061 10.0027 61.4657 1.7525 5.2008 0.0273 4.0649 8.2269 4.6381 6.4186 30.8666 35.8240 9.6035 36.0510 5.3329 2.0479 8.8758 45.3381 14.5519 27.0894 29.2492 10.6988 6.6231 3.0423 14.7935 5.2253 19.6923 10.6586 0.9508 5.7058 0.6747 15.0223 23.0601 15.1454 13.7189 4.5486 6.6563 1.7286 8.9726 5.1656 15.6024 28.5938 5.2979 3.1477 12.4988 75.0627 81.5454 42.7029 27.7389 34.8200 21.3787 6.2388 23.4522 19.9781 47.5411 40.9092 10.6750 1.2664 12.8062 16.6627 18.6739 14.7124
temp: 298.150 k
press: 1.00000 atm
elementType: 17 7 7 7 7 6 6 6 6 6 6 6 6 6 6 6 6 1 1 1 1 1 1 1 1 1 1 1 1 1 1 1 1 1
symmnumber: 1
zpe: 727622.4 jmol-1
zpe.correction: 0.277137 hartree
zpe.thermalcorrener: 0.293368 hartree
zpe.thermalcorrenthalpy: 0.294312 hartree
zpe.thermalcorrgfe: 0.229381 hartree
zpe.sumelectzpe: -1145.212687 hartree
zpe.sumelectthermal: -1145.196456 hartree
zpe.sumelectthermalent: -1145.195512 hartree
zpe.sumelectthermalfe: -1145.260443 hartree
dipole: 1.2499 6.3038 -0.6353
dipole: 6.4578
quadrupole: -116.7753 -115.1461 -110.3617
quadrupole: 0.4862 -6.5950 1.3187
quadrupole: -2.6810 -1.0517 3.7327 0.4862 -6.5950 1.3187
hfenergy: -1145.4898237 hartree
pointgroup: C01 [X(C12H17Cl1N4)]
dipole: 0.2264484 2.5245582 -0.1746999 debye
polarizability: 225.2862359|17.8030663|175.6626205|-17.8575786|-4.9201996|104.0944128 unknown
InChI: InChI=1S/C12H17ClN4/c1-2-16(8-7-13)9-10-17-12-6-4-3-5-11(12)14-15-17/h3-6H,2,7-10H2,1H3
charge 0 multiplicity 1
34 atoms
Cl -5.699259 -2.291378 -0.461292
N  -2.64187 0.496576 -0.126509
N  0.951279 -0.543763 0.52505
N  1.245586 -1.940025 0.594403
N  2.51552 -2.114625 0.2078
C  -1.299018 -0.0195 -0.444052
C  -0.4039 -0.076513 0.824956
C  -3.77717 -0.247279 -0.713369
C  -2.772182 1.974047 -0.113725
C  2.060541 0.152994 0.074038
C  -4.256454 -1.308413 0.287613
C  -3.826082 2.478249 0.890755
C  3.060646 -0.855788 -0.121672
C  2.3220 1.522863 -0.172013
C  4.357609 -0.513761 -0.575744
C  3.615348 1.846027 -0.622007
C  4.619488 0.845104 -0.822938
H  -0.788955 0.590358 -1.226435
H  -1.384312 -1.045845 -0.844329
H  -0.849093 -0.773663 1.552735
H  -0.3407 0.919106 1.300487
H  -3.510127 -0.735475 -1.674624
H  -4.609114 0.446985 -0.929025
H  -1.787197 2.395508 0.163667
H  -3.006865 2.367691 -1.13274
H  -3.480224 -2.05444 0.515338
H  -4.643499 -0.855226 1.211355
H  -4.833653 2.092222 0.651173
H  -3.569665 2.151122 1.913598
H  -3.879927 3.582589 0.873363
H  1.564565 2.298688 -0.021438
H  5.117177 -1.286898 -0.723273
H  3.864461 2.893424 -0.825584
H  5.609947 1.15144 -1.175261
