program: Orca
programVersion: 5.0.3
elementType: C H C H C C C H H C H H C C H H H H H H H
charge: 1
multiplicity: 1
keywords: b3lyp def2-TZVP EnGrad D3BJ RIJCOSX verytightscf def2/J soscf
formula: C8H13
InChI: InChI=1/C8H13/c1-2-4-6-8-7-5-3-1/h1-2,7H,3-6,8H2
21 atoms
C  -2.002717 0.744077 0.069481
H  -2.167802 0.809346 1.147753
C  -1.733182 -0.975546 -0.166484
H  -2.620441 -1.34225 0.354349
C  -0.410888 -1.384523 0.386767
C  0.680727 -1.270444 -0.389007
C  1.995059 -0.700822 0.0632
H  2.19762 -0.912035 1.118581
H  2.852434 -1.037433 -0.526499
C  1.788498 0.838158 -0.131724
H  1.821687 1.102057 -1.194649
H  2.594062 1.388677 0.361401
C  0.427057 1.29626 0.497062
C  -0.764784 1.288848 -0.355625
H  0.516322 -1.189324 -1.46816
H  -1.828684 -1.136641 -1.241134
H  0.224829 0.768347 1.432108
H  -0.658745 1.63631 -1.387205
H  -2.880483 0.99784 -0.52374
H  0.518051 2.369713 0.777047
H  -0.323989 -1.469334 1.469187
totalener: -312.21598327 hartree
nucrepener: 379.11754861 hartree
electener: -691.33353189 hartree
oneelecener: -1159.33214737 hartree
twoeener: 467.99861548 hartree
kineticenergy: 310.53472533 hartree
exchangeener: -36.318606277625 hartree
correlationener: -2.303105525226 hartree
xcener: -38.621711802851 hartree
chargesum: 1.0000000
charge: -0.233286 0.186954 -0.201093 0.183488 -0.171597 -0.064811 -0.205184 0.144502 0.154573 -0.250053 0.146825 0.160032 -0.127524 0.086622 0.124510 0.178333 0.146848 0.203221 0.183340 0.197989 0.156311
charge: -0.159419 0.171619 -0.116221 0.160838 -0.177791 -0.120698 -0.218998 0.151088 0.151834 -0.200438 0.146119 0.154019 -0.201693 0.098213 0.152416 0.154508 0.166185 0.172494 0.160339 0.206150 0.149437
qa: -0.2333 0.1870 -0.2011 0.1835 -0.1716 -0.0648 -0.2052 0.1445 0.1546 -0.2501 0.1468 0.1600 -0.1275 0.0866 0.1245 0.1783 0.1468 0.2032 0.1833 0.1980 0.1563
va: 3.8621 0.9593 3.8113 0.9576 3.8243 3.7964 3.8617 0.9708 0.9722 3.8960 0.9669 0.9652 3.7806 3.5820 0.9695 0.9599 0.9916 0.9486 0.9663 0.9514 0.9684
dispcorr: -0.036582390 hartree
energy: -312.252565663545
dipole: 0.22929 -1.06104 -0.83174 1.85902 -0.66886 1.19017 0.29872 -0.42820 -0.12948
magnitude: 1.45776 au
magnitude: 3.70532 debye
