program: Orca
programVersion: 5.0.3
elementType: C H C H C C C H H C H H C C H H H H H H H
charge: 1
multiplicity: 1
keywords: DSD-PBEP86/2013 def2-TZVP RIJCOSX verytightscf def2-TZVP/C def2/J soscf noTRAH
formula: C8H13
InChI: InChI=1/C8H13/c1-2-4-6-8-7-5-3-1/h1-2,7H,3-6,8H2
21 atoms
C  -2.002717 0.744077 0.069481
H  -2.167802 0.809346 1.147753
C  -1.733182 -0.975546 -0.166484
H  -2.620441 -1.34225 0.354349
C  -0.410888 -1.384523 0.386767
C  0.680727 -1.270444 -0.389007
C  1.995059 -0.700822 0.0632
H  2.19762 -0.912035 1.118581
H  2.852434 -1.037433 -0.526499
C  1.788498 0.838158 -0.131724
H  1.821687 1.102057 -1.194649
H  2.594062 1.388677 0.361401
C  0.427057 1.29626 0.497062
C  -0.764784 1.288848 -0.355625
H  0.516322 -1.189324 -1.46816
H  -1.828684 -1.136641 -1.241134
H  0.224829 0.768347 1.432108
H  -0.658745 1.63631 -1.387205
H  -2.880483 0.99784 -0.52374
H  0.518051 2.369713 0.777047
H  -0.323989 -1.469334 1.469187
totalener: -311.13873667 hartree
nucrepener: 379.11754861 hartree
electener: -690.25628528 hartree
oneelecener: -1158.68153952 hartree
twoeener: 468.42525425 hartree
kineticenergy: 310.00022112 hartree
exchangeener: -12.754519042400 hartree
correlationener: -0.942826021699 hartree
xcener: -13.697345064100 hartree
chargesum: 1.0000000
charge: -0.277914 0.199600 -0.197717 0.192307 -0.208747 -0.107226 -0.211876 0.154115 0.165316 -0.269373 0.153592 0.170688 -0.156845 0.113612 0.140347 0.187483 0.157654 0.218043 0.195667 0.209938 0.171339
charge: -0.167713 0.169073 -0.114497 0.156314 -0.181641 -0.125243 -0.216878 0.148816 0.148716 -0.200770 0.142733 0.150434 -0.205269 0.149117 0.151324 0.152024 0.164394 0.174942 0.157426 0.197958 0.148740
qa: -0.2779 0.1996 -0.1977 0.1923 -0.2087 -0.1072 -0.2119 0.1541 0.1653 -0.2694 0.1536 0.1707 -0.1568 0.1136 0.1403 0.1875 0.1577 0.2180 0.1957 0.2099 0.1713
va: 3.8806 0.9580 3.8280 0.9586 3.8564 3.8442 3.8739 0.9731 0.9730 3.9055 0.9688 0.9658 3.8057 3.5308 0.9687 0.9589 0.9885 0.9423 0.9653 0.9481 0.9645
total: -311.820771484 hartree
energy: -311.820771484202
dipole: 0.22929 -1.10187 -0.87258 1.85902 -0.56073 1.29829 0.29872 -0.48825 -0.18953
magnitude: 1.57571 au
magnitude: 4.00514 debye
