program: Orca
programVersion: 5.0.3
elementType: C H C H C C C H H C H H C C H H H H H H H
charge: 1
multiplicity: 1
keywords: DSD-PBEP86 def2-TZVP D3BJ RIJCOSX verytightscf def2-TZVP/C def2/J soscf noTRAH
formula: C8H13
InChI: InChI=1/C8H13/c1-3-7-5-2-6-8(4-1)9-7/h3,6-8H,1-2,4-5H2
21 atoms
C  -2.00546 0.689551 0.091679
H  -2.215572 0.876435 1.149048
C  -1.800155 -0.92128 -0.136855
H  -2.629573 -1.417918 0.369778
C  -0.440501 -1.336348 0.408119
C  0.697625 -1.277899 -0.361988
C  2.009349 -0.681833 0.081638
H  2.222336 -0.881684 1.136275
H  2.85593 -1.013447 -0.522296
C  1.812056 0.915343 -0.137102
H  1.87913 1.138123 -1.206832
H  2.629379 1.429288 0.371956
C  0.438103 1.305518 0.412471
C  -0.710147 1.302012 -0.356401
H  0.533132 -1.208384 -1.44157
H  -1.8734 -1.13217 -1.208231
H  0.009233 0.024839 0.292343
H  -0.559231 1.27567 -1.439629
H  -2.860071 1.006675 -0.508208
H  0.342339 1.410363 1.496632
H  -0.34426 -1.451814 1.490245
totalener: -311.07447243 hartree
nucrepener: 382.64978840 hartree
electener: -693.72426083 hartree
oneelecener: -1165.24992724 hartree
twoeener: 471.52566641 hartree
kineticenergy: 309.94752464 hartree
exchangeener: -13.662509937250 hartree
correlationener: -0.927697305177 hartree
xcener: -14.590207242427 hartree
chargesum: 1.0000000
charge: -0.217235 0.165684 -0.261678 0.182846 -0.125664 -0.037845 -0.218189 0.163454 0.179186 -0.265209 0.168997 0.181908 -0.113583 -0.030992 0.158800 0.170173 0.175564 0.165363 0.181058 0.191280 0.186083
charge: -0.192880 0.151651 -0.190268 0.153975 -0.152617 -0.066351 -0.196258 0.150876 0.153683 -0.192068 0.149713 0.153264 -0.153832 -0.044074 0.162874 0.150053 0.315375 0.164584 0.154548 0.165495 0.162259
qa: -0.2172 0.1657 -0.2617 0.1828 -0.1257 -0.0378 -0.2182 0.1635 0.1792 -0.2652 0.1690 0.1819 -0.1136 -0.0310 0.1588 0.1702 0.1756 0.1654 0.1811 0.1913 0.1861
va: 3.8656 0.9714 3.9368 0.9672 3.7698 3.8756 3.8719 0.9715 0.9674 3.9401 0.9672 0.9684 3.7347 3.8826 0.9661 0.9673 1.0238 0.9634 0.9666 0.9606 0.9622
total: -311.760152296 hartree
dispcorr: -0.011973822 hartree
energy: -311.772126118880
dipole: -0.00994 -0.04418 -0.05412 0.05284 0.03890 0.09174 -0.01901 -0.03013 -0.04914
magnitude: 0.11730 au
magnitude: 0.29814 debye
