program: Orca
programVersion: 5.0.3
elementType: C H C H C C C H H C H H C C H H H H H H H
charge: 1
multiplicity: 1
keywords: PBE0 def2-TZVP EnGrad D3BJ RIJCOSX verytightscf def2/J soscf
formula: C8H13
InChI: InChI=1/C8H13/c1-2-4-6-8-7-5-3-1/h1-2,7H,3-6,8H2
21 atoms
C  -1.9971 0.75276 0.073295
H  -2.174261 0.849358 1.147552
C  -1.736968 -0.952177 -0.151517
H  -2.618426 -1.321147 0.377849
C  -0.422599 -1.379249 0.398222
C  0.690412 -1.281616 -0.370565
C  2.004534 -0.688282 0.064893
H  2.215661 -0.879815 1.122702
H  2.857545 -1.030139 -0.526602
C  1.793887 0.876356 -0.144525
H  1.84586 1.127444 -1.209335
H  2.60069 1.417798 0.355504
C  0.421839 1.252398 0.472101
C  -0.764132 1.311616 -0.37941
H  0.526861 -1.211509 -1.4506
H  -1.839856 -1.122361 -1.223863
H  0.153556 0.42416 1.142329
H  -0.649164 1.499546 -1.450531
H  -2.877316 0.984639 -0.525568
H  0.424624 2.073921 1.214157
H  -0.34279 -1.501821 1.478972
totalener: -312.02568025 hartree
nucrepener: 380.02560564 hartree
electener: -692.05128588 hartree
oneelecener: -1161.05197163 hartree
twoeener: 469.00068575 hartree
kineticenergy: 310.15675483 hartree
exchangeener: -34.164003252534 hartree
correlationener: -1.963501938631 hartree
xcener: -36.127505191165 hartree
chargesum: 1.0000000
charge: -0.241115 0.197691 -0.228315 0.197391 -0.191338 -0.085209 -0.224821 0.162391 0.167409 -0.281312 0.161576 0.172178 -0.137490 0.063594 0.139708 0.188618 0.143150 0.195650 0.196382 0.224653 0.179210
charge: -0.169911 0.171847 -0.134045 0.167540 -0.195310 -0.108978 -0.221087 0.154599 0.153701 -0.208023 0.148874 0.157385 -0.217169 0.089801 0.156650 0.158771 0.202342 0.171948 0.164822 0.201172 0.155071
qa: -0.2411 0.1977 -0.2283 0.1974 -0.1913 -0.0852 -0.2248 0.1624 0.1674 -0.2813 0.1616 0.1722 -0.1375 0.0636 0.1397 0.1886 0.1431 0.1956 0.1964 0.2247 0.1792
va: 3.9088 0.9590 3.9085 0.9551 3.8932 3.9319 3.9067 0.9690 0.9733 3.9718 0.9668 0.9681 3.7872 3.7377 0.9673 0.9591 1.0284 0.9539 0.9631 0.9443 0.9589
dispcorr: -0.019056171 hartree
energy: -312.044736416881
dipole: 0.11512 -0.91900 -0.80388 1.22673 -0.25328 0.97345 0.42395 -0.49802 -0.07407
magnitude: 1.26464 au
magnitude: 3.21446 debye
