program: Orca
programVersion: 5.0.3
elementType: C H C H C C C H H C H H C C H H H H H H H
charge: 1
multiplicity: 1
keywords: PBE0 def2-TZVP EnGrad D3BJ RIJCOSX verytightscf def2/J soscf
formula: C8H13
InChI: InChI=1/C8H13/c1-2-4-6-8-7-5-3-1/h1-2,7H,3-6,8H2
21 atoms
C  -1.99893 0.519301 0.107632
H  -2.185451 0.735622 1.162888
C  -1.99127 -1.011781 -0.155417
H  -2.681319 -1.602339 0.448129
C  -0.539904 -1.088939 0.27529
C  0.59305 -1.080412 -0.517805
C  1.903071 -0.634699 0.049359
H  1.998509 -0.961264 1.090398
H  2.741062 -1.043819 -0.520979
C  1.925303 0.932339 -0.011103
H  2.095839 1.251727 -1.045565
H  2.757102 1.313151 0.587296
C  0.570104 1.475084 0.481601
C  -0.51046 0.726715 -0.248176
H  0.510446 -1.278231 -1.585862
H  -2.128171 -1.249791 -1.213977
H  0.456622 1.384965 1.567205
H  -0.400958 0.809289 -1.332963
H  -2.67248 1.114639 -0.514801
H  0.480025 2.541338 0.22989
H  -0.381312 -1.04321 1.353474
totalener: -312.09044770 hartree
nucrepener: 387.21814500 hartree
electener: -699.30859270 hartree
oneelecener: -1175.25489176 hartree
twoeener: 475.94629905 hartree
kineticenergy: 310.19119167 hartree
exchangeener: -34.198521648390 hartree
correlationener: -1.978581046354 hartree
xcener: -36.177102694744 hartree
chargesum: 1.0000000
charge: -0.185671 0.162385 -0.188813 0.176881 -0.044007 -0.042013 -0.222388 0.162485 0.178319 -0.240965 0.156277 0.174585 -0.191593 -0.101158 0.202817 0.157009 0.146982 0.171693 0.174545 0.178538 0.174092
charge: -0.189737 0.158325 -0.185982 0.154961 -0.066758 -0.012126 -0.207883 0.162237 0.164761 -0.214156 0.153043 0.157045 -0.229214 -0.020425 0.170734 0.157599 0.156193 0.179360 0.154942 0.176673 0.180407
qa: -0.1857 0.1624 -0.1888 0.1769 -0.0440 -0.0420 -0.2224 0.1625 0.1783 -0.2410 0.1563 0.1746 -0.1916 -0.1012 0.2028 0.1570 0.1470 0.1717 0.1745 0.1785 0.1741
va: 3.9274 0.9757 3.9342 0.9706 3.9226 3.8527 3.9634 0.9666 0.9675 3.9542 0.9699 0.9661 3.9673 3.9167 0.9451 0.9741 0.9741 0.9617 0.9693 0.9658 0.9620
dispcorr: -0.017973400 hartree
energy: -312.108421103433
dipole: 0.55281 -0.66382 -0.11101 1.84598 -1.90293 -0.05695 0.21085 -0.37833 -0.16748
magnitude: 0.20884 au
magnitude: 0.53084 debye
