program: Orca
programVersion: 5.0.3
elementType: C H C H C C C H H C H H C C H H H H H H H
charge: 1
multiplicity: 1
keywords: PBE0 def2-TZVP EnGrad D3BJ RIJCOSX verytightscf def2/J soscf
formula: C8H13
InChI: InChI=1/C8H13/c1-3-7-5-2-6-8(4-1)9-7/h3,6-8H,1-2,4-5H2
21 atoms
C  -1.996904 0.672268 0.102554
H  -2.192785 0.863771 1.161999
C  -1.823505 -0.93062 -0.131868
H  -2.64137 -1.433736 0.386931
C  -0.453201 -1.335178 0.396384
C  0.689262 -1.272095 -0.366646
C  2.000022 -0.670989 0.0916
H  2.200267 -0.872694 1.148349
H  2.850593 -1.011541 -0.501594
C  1.826562 0.929808 -0.130732
H  1.909393 1.15166 -1.199472
H  2.641096 1.434601 0.391806
C  0.452183 1.320755 0.402351
C  -0.694014 1.285379 -0.357433
H  0.540392 -1.240623 -1.449896
H  -1.908449 -1.142648 -1.202382
H  0.003058 -0.000902 0.138685
H  -0.55427 1.283148 -1.442118
H  -2.853316 1.010742 -0.483321
H  0.345533 1.342883 1.489906
H  -0.345389 -1.382335 1.482963
totalener: -312.02061503 hartree
nucrepener: 382.84391369 hartree
electener: -694.86452872 hartree
oneelecener: -1166.21252403 hartree
twoeener: 471.34799531 hartree
kineticenergy: 310.12855326 hartree
exchangeener: -34.165470959968 hartree
correlationener: -1.977273600521 hartree
xcener: -36.142744560489 hartree
chargesum: 1.0000000
charge: -0.227605 0.167827 -0.252451 0.183625 -0.089163 -0.047790 -0.229151 0.167444 0.181255 -0.254321 0.170090 0.183298 -0.084267 -0.053526 0.159977 0.170467 0.168105 0.160165 0.181413 0.172544 0.172064
charge: -0.202202 0.157063 -0.200211 0.160408 -0.134073 -0.093225 -0.202511 0.156856 0.160414 -0.200532 0.156702 0.160168 -0.137076 -0.090871 0.167969 0.156891 0.320847 0.167490 0.160513 0.167940 0.167440
qa: -0.2276 0.1678 -0.2525 0.1836 -0.0892 -0.0478 -0.2292 0.1674 0.1813 -0.2543 0.1701 0.1833 -0.0843 -0.0535 0.1600 0.1705 0.1681 0.1602 0.1814 0.1725 0.1721
va: 3.9346 0.9694 3.9715 0.9665 3.8700 3.9171 3.9381 0.9693 0.9669 3.9751 0.9680 0.9668 3.8565 3.9318 0.9652 0.9680 1.0467 0.9647 0.9667 0.9638 0.9637
dispcorr: -0.019025141 hartree
energy: -312.039640168936
dipole: -0.00488 -0.00288 -0.00775 0.00282 -0.00449 -0.00167 -0.07285 0.05665 -0.01620
magnitude: 0.01804 au
magnitude: 0.04584 debye
