program: Orca
programVersion: 5.0.3
elementType: C H C H C C C H H C H H C C H H H H H H H
charge: 1
multiplicity: 1
keywords: PBE0 def2-TZVP EnGrad RIJCOSX verytightscf def2/J soscf
formula: C8H13
InChI: InChI=1/C8H13/c1-2-4-6-8-7-5-3-1/h1-2,7H,3-6,8H2
21 atoms
C  -2.000157 0.732838 0.078316
H  -2.197069 0.868024 1.14546
C  -1.753407 -0.935073 -0.14592
H  -2.618518 -1.349843 0.376564
C  -0.427892 -1.363842 0.405978
C  0.695865 -1.284575 -0.365582
C  2.007727 -0.687289 0.068677
H  2.220766 -0.878427 1.126072
H  2.858986 -1.024113 -0.527293
C  1.799635 0.892579 -0.1448
H  1.857818 1.131814 -1.211819
H  2.61208 1.423856 0.355455
C  0.423609 1.263651 0.446722
C  -0.750279 1.31919 -0.37463
H  0.530346 -1.211791 -1.445044
H  -1.847233 -1.125297 -1.216804
H  0.098031 0.254488 0.868852
H  -0.618164 1.381657 -1.458882
H  -2.870932 0.988427 -0.52605
H  0.379561 1.805214 1.402803
H  -0.347041 -1.516874 1.484128
totalener: -312.01503614 hartree
nucrepener: 380.92946520 hartree
electener: -692.94450133 hartree
oneelecener: -1162.72536927 hartree
twoeener: 469.78086793 hartree
kineticenergy: 310.13000546 hartree
exchangeener: -34.159722527844 hartree
correlationener: -1.968033193717 hartree
xcener: -36.127755721561 hartree
chargesum: 1.0000000
charge: -0.224129 0.185481 -0.272205 0.193902 -0.107847 -0.100632 -0.213386 0.163562 0.170738 -0.309449 0.169649 0.176275 -0.040186 0.022257 0.143892 0.184362 0.071894 0.183495 0.192608 0.221165 0.188554
charge: -0.181373 0.165661 -0.161745 0.166673 -0.197442 -0.093408 -0.217157 0.155398 0.155029 -0.204937 0.151363 0.157945 -0.211049 0.057869 0.158734 0.157618 0.251968 0.170496 0.164619 0.193215 0.160522
qa: -0.2241 0.1855 -0.2722 0.1939 -0.1078 -0.1006 -0.2134 0.1636 0.1707 -0.3094 0.1696 0.1763 -0.0402 0.0223 0.1439 0.1844 0.0719 0.1835 0.1926 0.2212 0.1886
va: 3.8913 0.9643 3.9852 0.9576 3.7785 3.9904 3.8905 0.9699 0.9713 4.0005 0.9636 0.9685 3.6813 3.8472 0.9664 0.9607 1.1027 0.9556 0.9636 0.9502 0.9571
energy: -312.015036138356
dipole: 0.05498 -0.62262 -0.56764 0.70070 -0.00168 0.69902 0.35022 -0.38302 -0.03280
magnitude: 0.90107 au
magnitude: 2.29034 debye
