program: Orca
programVersion: 5.0.3
elementType: C H C H C C C H H C H H C C H H H H H H H
charge: 1
multiplicity: 1
keywords: m062x def2-TZVP EnGrad RIJCOSX verytightscf def2/J soscf
formula: C8H13
InChI: InChI=1/C8H13/c1-2-4-6-8-7-5-3-1/h1-2,7H,3-6,8H2
21 atoms
C  -1.993003 0.545699 0.115152
H  -2.168523 0.732446 1.178585
C  -1.909109 -0.983232 -0.174414
H  -2.670269 -1.558202 0.357624
C  -0.489338 -1.211074 0.304973
C  0.6238 -1.171245 -0.484271
C  1.915378 -0.669621 0.070581
H  2.03591 -0.949963 1.122388
H  2.780686 -1.040673 -0.486593
C  1.863805 0.889914 -0.059588
H  1.949831 1.166496 -1.117255
H  2.715393 1.340605 0.457539
C  0.535694 1.47469 0.503349
C  -0.596552 0.960252 -0.290319
H  0.533351 -1.30881 -1.561703
H  -2.00011 -1.181728 -1.246916
H  0.406888 1.290395 1.574126
H  -0.461574 1.053248 -1.371374
H  -2.760456 1.059646 -0.474684
H  0.578394 2.569593 0.35817
H  -0.346186 -1.174433 1.386565
totalener: -312.30409100 hartree
nucrepener: 383.17464239 hartree
electener: -695.47873339 hartree
oneelecener: -1167.07101437 hartree
twoeener: 471.59228098 hartree
kineticenergy: 310.38843778 hartree
xcener: -23.098580279233 hartree
chargesum: 1.0000000
charge: -0.294600 0.205390 -0.298156 0.201797 -0.088907 -0.085209 -0.334310 0.202989 0.201807 -0.300796 0.200832 0.200234 -0.303351 0.023571 0.208105 0.201941 0.200924 0.227053 0.204144 0.227197 0.199344
charge: -0.207408 0.160585 -0.201487 0.155579 -0.070429 -0.078876 -0.221000 0.159027 0.162958 -0.211309 0.153040 0.156813 -0.229872 0.092144 0.164130 0.158389 0.160674 0.173882 0.162726 0.193142 0.167288
qa: -0.2946 0.2054 -0.2982 0.2018 -0.0889 -0.0852 -0.3343 0.2030 0.2018 -0.3008 0.2008 0.2002 -0.3034 0.0236 0.2081 0.2019 0.2009 0.2271 0.2041 0.2272 0.1993
va: 3.7354 0.9513 3.7343 0.9619 3.6890 3.6530 3.7641 0.9478 0.9586 3.6949 0.9458 0.9556 3.7431 3.4861 0.9489 0.9528 0.9509 0.9334 0.9593 0.9440 0.9492
energy: -312.304091002261
dipole: 0.55602 -0.83418 -0.27816 1.87088 -1.37159 0.49929 0.16520 -0.30383 -0.13863
magnitude: 0.58812 au
magnitude: 1.49487 debye
