program: Orca
programVersion: 5.0.3
elementType: C H C H C C C H H C H H C C H H H H H H H
charge: 1
multiplicity: 1
keywords: PBE0 def2-TZVP EnGrad RIJCOSX verytightscf def2/J soscf
formula: C8H13
InChI: InChI=1/C8H13/c1-3-7-5-2-6-8(4-1)9-7/h3,6-8H,1-2,4-5H2
21 atoms
C  -2.00546 0.689551 0.091679
H  -2.215572 0.876435 1.149048
C  -1.800155 -0.92128 -0.136855
H  -2.629573 -1.417918 0.369778
C  -0.440501 -1.336348 0.408119
C  0.697625 -1.277899 -0.361988
C  2.009349 -0.681833 0.081638
H  2.222336 -0.881684 1.136275
H  2.85593 -1.013447 -0.522296
C  1.812056 0.915343 -0.137102
H  1.87913 1.138123 -1.206832
H  2.629379 1.429288 0.371956
C  0.438103 1.305518 0.412471
C  -0.710147 1.302012 -0.356401
H  0.533132 -1.208384 -1.44157
H  -1.8734 -1.13217 -1.208231
H  0.009233 0.024839 0.292343
H  -0.559231 1.27567 -1.439629
H  -2.860071 1.006675 -0.508208
H  0.342339 1.410363 1.496632
H  -0.34426 -1.451814 1.490245
totalener: -312.01858827 hartree
nucrepener: 382.64978840 hartree
electener: -694.66837667 hartree
oneelecener: -1165.87001044 hartree
twoeener: 471.20163376 hartree
kineticenergy: 310.12361548 hartree
exchangeener: -34.163456906580 hartree
correlationener: -1.976404563835 hartree
xcener: -36.139861470415 hartree
chargesum: 1.0000000
charge: -0.220911 0.167493 -0.269759 0.184327 -0.091413 -0.036611 -0.222599 0.165476 0.180295 -0.271183 0.172268 0.183308 -0.080070 -0.032243 0.154589 0.173748 0.139548 0.158805 0.182091 0.183790 0.179052
charge: -0.201217 0.157509 -0.197596 0.160746 -0.154869 -0.079149 -0.204804 0.156817 0.159903 -0.199471 0.156363 0.159939 -0.156444 -0.062915 0.167036 0.156625 0.315441 0.167983 0.160714 0.170319 0.167072
qa: -0.2209 0.1675 -0.2698 0.1843 -0.0914 -0.0366 -0.2226 0.1655 0.1803 -0.2712 0.1723 0.1833 -0.0801 -0.0322 0.1546 0.1737 0.1395 0.1588 0.1821 0.1838 0.1791
va: 3.9177 0.9699 3.9957 0.9663 3.8202 3.9410 3.9240 0.9700 0.9668 3.9984 0.9664 0.9674 3.7890 3.9533 0.9657 0.9662 1.0664 0.9641 0.9661 0.9613 0.9626
energy: -312.018588273368
dipole: -0.00994 -0.03569 -0.04564 0.05284 0.01723 0.07007 -0.01901 -0.00249 -0.02150
magnitude: 0.08634 au
magnitude: 0.21946 debye
