program: Orca
programVersion: 5.0.3
charge: 1
multiplicity: 1
keywords: DLPNO-CCSD(T1) tightPNO Extrapolate(3/4,def2) RIJK def2/JK verytightSCF miniprint nopop
formula: C8H13
InChI: InChI=1/C8H13/c1-2-4-6-8-7-5-3-1/h1-2,7H,3-6,8H2
21 atoms
C  -2.002446 0.700915 0.072661
H  -2.176429 0.794584 1.148755
C  -1.751422 -0.967389 -0.171501
H  -2.627607 -1.382707 0.333662
C  -0.410732 -1.370595 0.378728
C  0.673393 -1.266852 -0.401749
C  1.983865 -0.707338 0.066288
H  2.179033 -0.930674 1.120421
H  2.845708 -1.038159 -0.521493
C  1.796276 0.831125 -0.123533
H  1.82986 1.093128 -1.186956
H  2.605556 1.377526 0.368249
C  0.438112 1.337379 0.49934
C  -0.753246 1.270249 -0.339465
H  0.515058 -1.192726 -1.482114
H  -1.832315 -1.140808 -1.246707
H  0.257377 0.901111 1.483863
H  -0.655054 1.628224 -1.369036
H  -2.868236 0.991594 -0.523825
H  0.560798 2.434492 0.646493
H  -0.316668 -1.444179 1.461748
e0: -310.291422396 hartree
corrType: DLPNO BASED
e0: -310.305147949 hartree
basis: def2-TZVPP def2-QZVPP
scfener: -310.291422396 -310.305147949
corrmethod: MDCI MDCI
correner: -1.446909228 -1.517405689
corrcbsextra: -1.569625251
energy: -311.876663738969
dipole: 0.29693 -1.11256 -0.81564 1.95807 -0.52964 1.42842 0.21821 -0.43371 -0.21550
magnitude: 1.65894 au
magnitude: 4.21670 debye
