program: Orca
programVersion: 5.0.3
elementType: C H C H C C C H H C H H C C H H H H H H H
charge: 1
multiplicity: 1
keywords: PBE0 def2-TZVP EnGrad RIJCOSX verytightscf def2/J soscf
formula: C8H13
InChI: InChI=1/C8H13/c1-2-4-6-8-7-5-3-1/h1-2,7H,3-6,8H2
21 atoms
C  -1.996975 0.518036 0.098601
H  -2.187666 0.747785 1.150253
C  -1.996188 -1.015746 -0.146621
H  -2.682987 -1.597653 0.468833
C  -0.542865 -1.086784 0.278775
C  0.586157 -1.071387 -0.521172
C  1.901934 -0.631349 0.041056
H  2.002501 -0.969803 1.077878
H  2.733866 -1.039923 -0.538396
C  1.930933 0.935625 -0.001964
H  2.113469 1.266311 -1.030737
H  2.756913 1.307351 0.610034
C  0.571037 1.47347 0.482542
C  -0.502978 0.715989 -0.250467
H  0.49846 -1.273147 -1.58798
H  -2.139135 -1.267592 -1.201136
H  0.452758 1.384056 1.56773
H  -0.392002 0.802993 -1.334772
H  -2.6631 1.110344 -0.534304
H  0.474935 2.538443 0.229253
H  -0.379216 -1.040052 1.356098
totalener: -312.09086054 hartree
nucrepener: 387.38781538 hartree
electener: -699.47867592 hartree
oneelecener: -1175.58737194 hartree
twoeener: 476.10869602 hartree
kineticenergy: 310.19169713 hartree
exchangeener: -34.199476689296 hartree
correlationener: -1.979025367047 hartree
xcener: -36.178502056343 hartree
chargesum: 1.0000000
charge: -0.186175 0.162635 -0.188713 0.176799 -0.039729 -0.042912 -0.223300 0.162653 0.177942 -0.240723 0.156073 0.174005 -0.193754 -0.099494 0.203828 0.157155 0.146386 0.170538 0.174385 0.177767 0.174632
charge: -0.188300 0.158420 -0.185257 0.155013 -0.064848 -0.012503 -0.207625 0.162357 0.164559 -0.214554 0.152930 0.156904 -0.228966 -0.024158 0.170932 0.157602 0.155939 0.180302 0.154671 0.175724 0.180858
qa: -0.1862 0.1626 -0.1887 0.1768 -0.0397 -0.0429 -0.2233 0.1627 0.1779 -0.2407 0.1561 0.1740 -0.1938 -0.0995 0.2038 0.1572 0.1464 0.1705 0.1744 0.1778 0.1746
va: 3.9286 0.9756 3.9361 0.9707 3.9199 3.8500 3.9635 0.9662 0.9676 3.9562 0.9699 0.9665 3.9675 3.9185 0.9442 0.9740 0.9741 0.9623 0.9692 0.9660 0.9616
energy: -312.090860535038
dipole: 0.55177 -0.67246 -0.12070 1.84321 -1.91737 -0.07417 0.21798 -0.38573 -0.16775
magnitude: 0.21957 au
magnitude: 0.55809 debye
