program: Orca
programVersion: 5.0.3
elementType: C H C H C C C H H C H H C C H H H H H H H
charge: 1
multiplicity: 1
keywords: DSD-PBEP86 def2-TZVP RIJCOSX verytightscf def2-TZVP/C def2/J soscf noTRAH
formula: C8H13
InChI: InChI=1/C8H13/c1-2-4-6-8-7-5-3-1/h1-2,7H,3-6,8H2
21 atoms
C  -1.991337 0.553194 0.110274
H  -2.167017 0.738066 1.17437
C  -1.890438 -0.978073 -0.174849
H  -2.66702 -1.543728 0.345651
C  -0.47803 -1.236536 0.315608
C  0.629225 -1.188872 -0.47485
C  1.920148 -0.676294 0.071713
H  2.050411 -0.948512 1.124462
H  2.78755 -1.039293 -0.488137
C  1.853175 0.880683 -0.069529
H  1.926187 1.152044 -1.129502
H  2.703315 1.345629 0.437519
C  0.525393 1.466804 0.507452
C  -0.616443 1.013176 -0.299637
H  0.532233 -1.305776 -1.554449
H  -1.972433 -1.175292 -1.248468
H  0.392244 1.252612 1.571769
H  -0.486253 1.142802 -1.377972
H  -2.775553 1.042744 -0.478585
H  0.596187 2.565033 0.393218
H  -0.338653 -1.212202 1.398033
totalener: -311.16741897 hartree
nucrepener: 382.35027768 hartree
electener: -693.51769665 hartree
oneelecener: -1165.05742293 hartree
twoeener: 471.53972628 hartree
kineticenergy: 309.99897168 hartree
exchangeener: -12.758486796779 hartree
correlationener: -0.945389771314 hartree
xcener: -13.703876568094 hartree
chargesum: 1.0000000
charge: -0.208007 0.169836 -0.205669 0.177899 -0.120816 -0.126063 -0.223181 0.157330 0.171012 -0.237970 0.150764 0.174766 -0.193876 0.056148 0.182293 0.163090 0.160550 0.203239 0.181276 0.196707 0.170669
charge: -0.197557 0.156612 -0.194657 0.150168 -0.081542 -0.094576 -0.216240 0.151787 0.154963 -0.202611 0.145501 0.150394 -0.220074 0.152467 0.158217 0.152645 0.155739 0.173325 0.158489 0.186667 0.160284
qa: -0.2080 0.1698 -0.2057 0.1779 -0.1208 -0.1261 -0.2232 0.1573 0.1710 -0.2380 0.1508 0.1748 -0.1939 0.0561 0.1823 0.1631 0.1605 0.2032 0.1813 0.1967 0.1707
va: 3.8488 0.9703 3.8527 0.9704 3.8597 3.8574 3.8993 0.9710 0.9702 3.8651 0.9717 0.9640 3.8955 3.5884 0.9582 0.9741 0.9727 0.9436 0.9690 0.9598 0.9629
total: -311.849629855 hartree
energy: -311.849629855336
dipole: 0.54464 -0.95794 -0.41330 1.88543 -1.15535 0.73008 0.15716 -0.32861 -0.17145
magnitude: 0.85629 au
magnitude: 2.17651 debye
