program: Orca
programVersion: 5.0.3
elementType: C H C H C C C H H C H H C C H H H H H H H
charge: 1
multiplicity: 1
keywords: DSD-PBEP86 def2-TZVP RIJCOSX verytightscf def2-TZVP/C def2/J soscf noTRAH
formula: C8H13
InChI: InChI=1/C8H13/c1-2-4-6-8-7-5-3-1/h1-2,7H,3-6,8H2
21 atoms
C  -1.990158 0.561911 0.10408
H  -2.166255 0.744532 1.168996
C  -1.871696 -0.972793 -0.174767
H  -2.662988 -1.528395 0.335146
C  -0.466775 -1.259927 0.326631
C  0.635016 -1.205495 -0.464569
C  1.926138 -0.682851 0.072405
H  2.066877 -0.94691 1.125825
H  2.794631 -1.038061 -0.491389
C  1.843477 0.871502 -0.079618
H  1.905184 1.138169 -1.141403
H  2.690495 1.350657 0.419554
C  0.514009 1.45584 0.510311
C  -0.636803 1.064214 -0.307721
H  0.530473 -1.298654 -1.546192
H  -1.945343 -1.169653 -1.249171
H  0.376769 1.209238 1.566677
H  -0.51545 1.241889 -1.380657
H  -2.789643 1.026227 -0.484554
H  0.610295 2.556018 0.428523
H  -0.331896 -1.250905 1.409768
totalener: -311.16337204 hartree
nucrepener: 381.60477607 hartree
electener: -692.76814811 hartree
oneelecener: -1163.58774635 hartree
twoeener: 470.81959824 hartree
kineticenergy: 309.99748062 hartree
exchangeener: -12.757699269765 hartree
correlationener: -0.944742165157 hartree
xcener: -13.702441434922 hartree
chargesum: 1.0000000
charge: -0.207061 0.171572 -0.207072 0.177570 -0.135620 -0.134984 -0.221785 0.157128 0.169494 -0.240370 0.150882 0.174751 -0.186319 0.073447 0.175841 0.164011 0.161880 0.206793 0.181983 0.199538 0.168323
charge: -0.197005 0.158320 -0.194780 0.150417 -0.091824 -0.110210 -0.218057 0.151251 0.154535 -0.200204 0.145172 0.150405 -0.217758 0.172746 0.156700 0.152710 0.156651 0.174022 0.159723 0.189558 0.157628
qa: -0.2071 0.1716 -0.2071 0.1776 -0.1356 -0.1350 -0.2218 0.1571 0.1695 -0.2404 0.1509 0.1748 -0.1863 0.0734 0.1758 0.1640 0.1619 0.2068 0.1820 0.1995 0.1683
va: 3.8439 0.9692 3.8525 0.9698 3.8655 3.8587 3.8981 0.9715 0.9706 3.8673 0.9715 0.9635 3.8837 3.5572 0.9607 0.9738 0.9737 0.9417 0.9686 0.9584 0.9635
total: -311.844703833 hartree
energy: -311.844703833177
dipole: 0.52770 -0.99340 -0.46570 1.90422 -1.00205 0.90217 0.15079 -0.32390 -0.17311
magnitude: 1.02992 au
magnitude: 2.61786 debye
