program: Orca
programVersion: 5.0.3
elementType: C H C H C C C H H C H H C C H H H H H H H
charge: 1
multiplicity: 1
keywords: DSD-PBEP86 cc-pVTZ EnGrad D3BJ RIJCOSX verytightscf cc-pVTZ/C def2/J soscf
formula: C8H13
InChI: InChI=1/C8H13/c1-2-4-6-8-7-5-3-1/h1-2,7H,3-6,8H2
21 atoms
C  -2.004639 0.714479 0.082712
H  -2.213284 0.878254 1.143862
C  -1.771048 -0.924877 -0.142124
H  -2.620135 -1.379704 0.37236
C  -0.431351 -1.350299 0.41063
C  0.698874 -1.28403 -0.363151
C  2.009933 -0.686495 0.072795
H  2.224141 -0.880609 1.128901
H  2.859107 -1.018869 -0.527809
C  1.803907 0.90212 -0.142643
H  1.863715 1.133448 -1.211237
H  2.619405 1.426035 0.359416
C  0.427201 1.281293 0.430027
C  -0.734129 1.317304 -0.365374
H  0.530875 -1.205882 -1.441936
H  -1.855518 -1.129438 -1.212525
H  0.050333 0.140951 0.605048
H  -0.586565 1.307284 -1.449792
H  -2.866285 0.996751 -0.52358
H  0.356121 1.605988 1.473548
H  -0.346998 -1.51101 1.487682
totalener: -311.06542502 hartree
nucrepener: 381.77307464 hartree
electener: -692.83849966 hartree
oneelecener: -1163.62043767 hartree
twoeener: 470.78193801 hartree
kineticenergy: 309.66236295 hartree
exchangeener: -13.657804296487 hartree
correlationener: -0.925857553637 hartree
xcener: -14.583661850124 hartree
chargesum: 1.0000000
charge: -0.246455 0.179440 -0.279235 0.190843 -0.101138 -0.076787 -0.242578 0.166773 0.182566 -0.270633 0.168309 0.184178 -0.126989 0.012294 0.176735 0.176989 0.104856 0.196468 0.193829 0.212179 0.198357
charge: 0.111260 0.001337 0.124095 0.003657 0.068502 0.132464 0.092592 -0.003433 -0.000409 0.115471 -0.007277 -0.000753 0.108096 0.229663 -0.006444 -0.005076 0.003691 0.007962 0.004992 0.023014 -0.003403
qa: -0.2465 0.1794 -0.2792 0.1908 -0.1011 -0.0768 -0.2426 0.1668 0.1826 -0.2706 0.1683 0.1842 -0.1270 0.0123 0.1767 0.1770 0.1049 0.1965 0.1938 0.2122 0.1984
va: 3.8781 0.9794 3.9401 0.9714 3.8050 3.8274 3.8886 0.9836 0.9731 3.9267 0.9830 0.9764 3.7992 3.7291 0.9799 0.9792 1.1046 0.9732 0.9711 0.9757 0.9776
dispcorr: -0.012091280 hartree
energy: -311.782546370229
dipole: 0.01399 -0.31363 -0.29964 0.34078 0.07643 0.41721 0.19135 -0.21269 -0.02134
magnitude: 0.51411 au
magnitude: 1.30676 debye
