program: Orca
programVersion: 5.0.3
elementType: C H C H C C C H H C H H C C H H H H H H H
charge: 1
multiplicity: 1
keywords: PBE0 cc-pVTZ EnGrad D3BJ RIJCOSX verytightscf cc-pVTZ/C def2/J soscf
formula: C8H13
InChI: InChI=1/C8H13/c1-2-4-6-8-7-5-3-1/h1-2,7H,3-6,8H2
21 atoms
C  -2.00569 0.708869 0.084303
H  -2.216339 0.879682 1.144025
C  -1.777025 -0.922827 -0.140966
H  -2.621346 -1.388964 0.370877
C  -0.4327 -1.346481 0.411233
C  0.699271 -1.28315 -0.362555
C  2.010372 -0.686021 0.074382
H  2.224813 -0.881369 1.130032
H  2.858828 -1.017407 -0.527564
C  1.805244 0.90479 -0.141631
H  1.865704 1.133904 -1.210621
H  2.621396 1.426603 0.361394
C  0.428886 1.287065 0.425601
C  -0.728748 1.315098 -0.362575
H  0.5308 -1.203934 -1.441154
H  -1.858269 -1.130196 -1.211495
H  0.037386 0.109843 0.524836
H  -0.578028 1.292604 -1.446379
H  -2.865018 0.999397 -0.521566
H  0.351175 1.553204 1.484301
H  -0.346467 -1.503582 1.488667
totalener: -312.01065618 hartree
nucrepener: 382.01747922 hartree
electener: -694.02813541 hartree
oneelecener: -1164.67282596 hartree
twoeener: 470.64469056 hartree
kineticenergy: 309.59264308 hartree
exchangeener: -34.140552282464 hartree
correlationener: -1.973155074798 hartree
xcener: -36.113707357262 hartree
chargesum: 1.0000000
charge: -0.189239 0.154283 -0.214603 0.161860 -0.084512 -0.045085 -0.184422 0.144810 0.156621 -0.206236 0.146106 0.156801 -0.094689 0.021681 0.154721 0.152838 0.093914 0.168641 0.165803 0.174582 0.166121
charge: 0.109569 0.001166 0.121250 0.003868 0.076895 0.140167 0.095124 -0.001897 0.001158 0.116418 -0.005146 0.000745 0.108562 0.212496 -0.003333 -0.003883 -0.002713 0.007256 0.005056 0.018655 -0.001414
qa: -0.1892 0.1543 -0.2146 0.1619 -0.0845 -0.0451 -0.1844 0.1448 0.1566 -0.2062 0.1461 0.1568 -0.0947 0.0217 0.1547 0.1528 0.0939 0.1686 0.1658 0.1746 0.1661
va: 3.8593 0.9895 3.9114 0.9849 3.7952 3.8070 3.8686 0.9923 0.9847 3.9041 0.9922 0.9881 3.7920 3.7365 0.9918 0.9894 1.1150 0.9877 0.9837 0.9937 0.9937
dispcorr: -0.019189340 hartree
energy: -312.029845521560
dipole: 0.00435 -0.22128 -0.21693 0.25313 0.06054 0.31367 0.13638 -0.16468 -0.02830
magnitude: 0.38242 au
magnitude: 0.97204 debye
