program: Orca
programVersion: 5.0.3
elementType: C H C H C C C H H C H H C C H H H H H H H
charge: 1
multiplicity: 1
keywords: m062x def2-TZVP EnGrad RIJCOSX verytightscf def2/J soscf
formula: C8H13
InChI: InChI=1/C8H13/c1-2-4-6-8-7-5-3-1/h1-2,7H,3-6,8H2
21 atoms
C  -1.989939 0.57279 0.096949
H  -2.166617 0.752518 1.162881
C  -1.85255 -0.966916 -0.174153
H  -2.658048 -1.511689 0.325871
C  -0.455361 -1.281549 0.337813
C  0.641479 -1.221012 -0.453543
C  1.933735 -0.689382 0.072674
H  2.085648 -0.945368 1.126455
H  2.802412 -1.036866 -0.496237
C  1.834507 0.862359 -0.089582
H  1.886697 1.125003 -1.152714
H  2.676675 1.355782 0.403933
C  0.501286 1.44152 0.511509
C  -0.657904 1.11266 -0.314573
H  0.528324 -1.286841 -1.536845
H  -1.918695 -1.163609 -1.249135
H  0.359683 1.160518 1.558262
H  -0.547856 1.344767 -1.378617
H  -2.803331 1.010979 -0.492061
H  0.61964 2.542482 0.463805
H  -0.325756 -1.290532 1.42142
totalener: -312.29112615 hartree
nucrepener: 380.94976886 hartree
electener: -693.24089501 hartree
oneelecener: -1162.68781707 hartree
twoeener: 469.44692206 hartree
kineticenergy: 310.38689953 hartree
xcener: -23.091481631821 hartree
chargesum: 1.0000000
charge: -0.302718 0.212113 -0.304618 0.201635 -0.140550 -0.106082 -0.336503 0.202498 0.199000 -0.299658 0.200944 0.200020 -0.288936 0.088239 0.193712 0.205570 0.206623 0.234072 0.206885 0.234755 0.192998
charge: -0.205062 0.166145 -0.201430 0.156298 -0.102401 -0.124296 -0.226533 0.157426 0.162020 -0.203624 0.152178 0.156871 -0.221630 0.148282 0.160059 0.158530 0.163151 0.175799 0.166464 0.202220 0.159535
qa: -0.3027 0.2121 -0.3046 0.2016 -0.1406 -0.1061 -0.3365 0.2025 0.1990 -0.2997 0.2009 0.2000 -0.2889 0.0882 0.1937 0.2056 0.2066 0.2341 0.2069 0.2348 0.1930
va: 3.7255 0.9461 3.7261 0.9592 3.6894 3.6550 3.7628 0.9493 0.9588 3.6925 0.9452 0.9542 3.7158 3.3989 0.9537 0.9510 0.9514 0.9301 0.9579 0.9406 0.9527
energy: -312.291126152301
dipole: 0.50484 -0.92922 -0.42438 1.92579 -0.93560 0.99019 0.14695 -0.28643 -0.13948
magnitude: 1.08629 au
magnitude: 2.76113 debye
